program: Orca
programVersion: 5.0.2
elementType: Cl S O O O O O O O C C C C C C C C C C C C C C C C C C C C H H H H H H H H H H H H H H H H H H H H H H H
charge: 0
multiplicity: 1
keywords: wb97x-d3
keywords: def2-TZVPP
keywords: def2/J RIJCOSX
keywords: DEFGRID2
keywords: scfconv7
keywords: smallprint printgap noloewdin
keywords: NOSOSCF
formula: C20H23ClO7S
InChI: InChI=1/C20H23ClO7S/c1-29(25,26)17-8-7-13(20(24)18-15(22)5-2-6-16(18)23)19(21)14(17)11-27-10-12-4-3-9-28-12/h7-8,12,22H,2-6,9-11H2,1H3
52 atoms
Cl 1.202505 -0.409874 -2.191415
S  -3.63626 -0.377056 0.558065
O  -1.424419 3.75191 1.155116
O  -1.74786 1.911515 -1.038447
O  1.905385 -0.012014 1.210968
O  4.543566 -3.436938 -0.625153
O  2.064779 -3.635206 -0.744981
O  -4.283397 0.244426 -0.594595
O  -4.338167 -1.492899 1.195281
C  -0.73232 3.864653 -0.087302
C  -1.569469 4.810652 -0.95913
C  -2.94369 4.782793 -0.298528
C  -2.571127 4.591422 1.159557
C  -0.509456 2.490489 -0.679552
C  3.114329 -1.745929 0.178424
C  5.438987 -0.496082 1.325973
C  4.238641 0.371721 0.990419
C  5.636731 -1.557568 0.260716
C  2.983232 -0.439238 0.828175
C  4.377965 -2.276784 -0.06569
C  1.965457 -2.505886 -0.25201
C  -1.179189 -0.433228 -0.863902
C  -1.627375 0.706849 -1.753985
C  0.580387 -1.956659 -0.118878
C  -1.983883 -0.967087 0.154879
C  0.100115 -0.973987 -0.97598
C  -0.258219 -2.485333 0.841911
C  -1.541474 -1.990065 0.979814
C  -3.337858 0.858845 1.789154
H  0.263898 4.285908 0.090892
H  -1.153602 5.81839 -0.915013
H  -1.584768 4.511686 -2.006832
H  -3.542318 3.945832 -0.660449
H  -3.512522 5.69759 -0.460132
H  -2.336843 5.554329 1.629805
H  -3.352285 4.110321 1.751526
H  0.137396 2.598495 -1.559473
H  0.029063 1.862162 0.042616
H  6.335333 0.117595 1.400808
H  5.2943 -0.970376 2.298572
H  4.411513 0.888038 0.038664
H  4.072171 1.138351 1.746771
H  6.397366 -2.284288 0.550579
H  5.985588 -1.097619 -0.671679
H  -2.597654 0.484967 -2.188299
H  -0.934138 0.822855 -2.589373
H  0.091476 -3.266507 1.503348
H  -2.178142 -2.405549 1.747194
H  -2.824559 0.408532 2.636553
H  -4.309127 1.242281 2.104711
H  -2.736981 1.659064 1.366381
H  3.638194 -3.820277 -0.818653
elementType: Cl S O C H
totalener: -2161.10300971 hartree
nucrepener: 3404.95932435 hartree
electener: -5566.06233406 hartree
oneelecener: -9741.23223477 hartree
twoeener: 4175.16990070 hartree
cpcmener: -0.05852007 hartree
kineticenergy: 2154.05400378 hartree
xcener: -162.936371534879 hartree
chargesum: 0.0000000
charge: -0.067533 0.880011 -0.438930 -0.363889 -0.492164 -0.310760 -0.452733 -0.563206 -0.573536 0.181706 -0.182479 -0.142066 0.024848 -0.014934 -0.338790 -0.135954 -0.077578 -0.078083 0.349295 0.310430 0.380854 -0.069266 -0.026466 0.151545 -0.030610 0.005238 -0.148293 -0.117680 -0.221225 0.088526 0.094847 0.083588 0.068850 0.082788 0.095355 0.091027 0.102494 0.090272 0.084997 0.085468 0.100579 0.082942 0.100858 0.113874 0.133817 0.115724 0.152946 0.149374 0.147878 0.142277 0.081683 0.272084
qa: -0.0675 0.8800 -0.4389 -0.3639 -0.4922 -0.3108 -0.4527 -0.5632 -0.5735 0.1817 -0.1825 -0.1421 0.0248 -0.0149 -0.3388 -0.1360 -0.0776 -0.0781 0.3493 0.3104 0.3809 -0.0693 -0.0265 0.1515 -0.0306 0.0052 -0.1483 -0.1177 -0.2212 0.0885 0.0948 0.0836 0.0689 0.0828 0.0954 0.0910 0.1025 0.0903 0.0850 0.0855 0.1006 0.0829 0.1009 0.1139 0.1338 0.1157 0.1529 0.1494 0.1479 0.1423 0.0817 0.2721
va: 1.2756 5.4968 1.9237 1.9291 1.9809 2.2529 2.0518 1.8969 1.8960 3.9209 3.9369 3.9259 3.8882 3.8805 3.4861 3.9342 3.8713 3.9474 3.8830 3.9187 3.7981 3.7243 3.8558 3.5291 3.7494 3.9049 4.0601 3.9740 3.8391 1.0003 1.0084 1.0190 1.0264 1.0184 0.9984 0.9939 1.0049 1.0137 1.0117 1.0077 1.0080 1.0299 1.0197 1.0062 1.0103 1.0108 1.0020 1.0180 1.0095 1.0141 1.0543 1.0546
dispcorr: -0.032885281 hartree
energy: -2161.135894995506
dipole: 3.62120 1.13633 4.75754 29.05935 -27.55699 1.50236 10.19254 -9.66670 0.52584
magnitude: 5.01675 au
magnitude: 12.75156 debye
