program: Orca
programVersion: 5.0.2
elementType: Cl S O O O O O O O C C C C C C C C C C C C C C C C C C C C H H H H H H H H H H H H H H H H H H H H H H H
charge: 0
multiplicity: 1
keywords: wb97x-d3
keywords: def2-TZVPP
keywords: def2/J RIJCOSX
keywords: DEFGRID2
keywords: scfconv7
keywords: smallprint printgap noloewdin
keywords: NOSOSCF
formula: C20H23ClO7S
InChI: InChI=1/C20H23ClO7S/c1-29(25,26)17-8-7-13(20(24)18-15(22)5-2-6-16(18)23)19(21)14(17)11-27-10-12-4-3-9-28-12/h7-8,12,22H,2-6,9-11H2,1H3
52 atoms
Cl 1.629721 0.698113 0.154041
S  -3.6557 -0.824838 0.443934
O  -1.290784 5.734141 -0.721859
O  -1.15013 2.148531 -0.297172
O  1.778563 -2.117682 2.03531
O  4.74353 -2.560796 -1.574986
O  2.321468 -2.256387 -2.040149
O  -4.377652 -2.043752 0.081069
O  -3.80187 -0.340603 1.81697
C  -1.304647 4.373667 -1.137224
C  -2.572952 4.214247 -1.968524
C  -3.521847 5.198225 -1.293932
C  -2.577577 6.324617 -0.900887
C  -1.277772 3.495525 0.104724
C  3.172512 -2.222872 0.147094
C  5.272079 -2.830493 2.017146
C  4.108125 -1.973571 2.485534
C  5.650146 -2.474417 0.591449
C  2.912372 -2.113227 1.584162
C  4.470982 -2.42635 -0.31219
C  2.120148 -2.096451 -0.830179
C  -0.943166 -0.122042 0.301523
C  -1.225127 1.269497 0.799058
C  0.717724 -1.745445 -0.443773
C  -1.917288 -1.107839 0.103893
C  0.366945 -0.472567 -0.013372
C  -0.276034 -2.690235 -0.627588
C  -1.594036 -2.375672 -0.352302
C  -4.145257 0.441993 -0.696851
H  -0.40296 4.180395 -1.727508
H  -2.382681 4.512385 -3.001898
H  -2.948045 3.190545 -1.984795
H  -3.989375 4.749364 -0.415448
H  -4.318513 5.543566 -1.951549
H  -2.522016 7.081926 -1.690227
H  -2.878054 6.827595 0.021215
H  -0.432481 3.783437 0.744392
H  -2.194391 3.638788 0.694197
H  6.131653 -2.685358 2.670395
H  5.001568 -3.88729 2.075115
H  4.399432 -0.916384 2.47338
H  3.814975 -2.216331 3.506953
H  6.385838 -3.168583 0.182453
H  6.109552 -1.478951 0.559521
H  -0.485733 1.5300 1.566818
H  -2.19667 1.3407 1.292331
H  -0.023922 -3.682247 -0.977317
H  -2.356207 -3.124348 -0.50845
H  -5.219969 0.581967 -0.571864
H  -3.932115 0.109743 -1.711281
H  -3.631984 1.37759 -0.490944
H  3.882529 -2.488812 -2.084979
elementType: Cl S O C H
totalener: -2161.10419529 hartree
nucrepener: 3291.79649331 hartree
electener: -5452.90068860 hartree
oneelecener: -9513.95338094 hartree
twoeener: 4061.05269234 hartree
cpcmener: -0.06240250 hartree
kineticenergy: 2154.04594533 hartree
xcener: -162.932026613137 hartree
chargesum: -0.0000000
charge: -0.060610 0.865179 -0.439810 -0.368962 -0.483232 -0.312412 -0.453030 -0.565072 -0.555573 0.228764 -0.167478 -0.156777 0.039475 -0.065951 -0.335016 -0.136709 -0.071056 -0.078503 0.326410 0.315328 0.390184 -0.016681 -0.090440 0.103789 0.023618 -0.059622 -0.127509 -0.112534 -0.230981 0.085988 0.093220 0.076977 0.079182 0.084867 0.081700 0.082318 0.094149 0.097922 0.085071 0.086036 0.099222 0.081996 0.100776 0.113990 0.127749 0.126166 0.152495 0.157865 0.144902 0.150184 0.120004 0.272433
qa: -0.0606 0.8652 -0.4398 -0.3690 -0.4832 -0.3124 -0.4530 -0.5651 -0.5556 0.2288 -0.1675 -0.1568 0.0395 -0.0660 -0.3350 -0.1367 -0.0711 -0.0785 0.3264 0.3153 0.3902 -0.0167 -0.0904 0.1038 0.0236 -0.0596 -0.1275 -0.1125 -0.2310 0.0860 0.0932 0.0770 0.0792 0.0849 0.0817 0.0823 0.0941 0.0979 0.0851 0.0860 0.0992 0.0820 0.1008 0.1140 0.1277 0.1262 0.1525 0.1579 0.1449 0.1502 0.1200 0.2724
va: 1.2842 5.5148 1.9398 1.8791 1.9974 2.2514 2.0540 1.9128 1.8890 3.8772 3.9119 3.9380 3.9321 3.9751 3.4588 3.9342 3.8606 3.9455 3.9329 3.9130 3.7766 3.7410 3.8717 3.5723 3.7035 4.0316 4.0427 3.9347 3.8659 1.0051 1.0093 1.0237 1.0063 1.0152 0.9914 0.9927 1.0114 0.9900 1.0115 1.0072 1.0090 1.0304 1.0197 1.0061 1.0020 1.0221 1.0036 1.0173 1.0151 1.0053 1.0090 1.0551
dispcorr: -0.029761433 hartree
energy: -2161.133956725721
dipole: -5.91146 8.38472 2.47326 21.95026 -21.27694 0.67332 -1.56116 0.61699 -0.94417
magnitude: 2.73163 au
magnitude: 6.94325 debye
