program: Orca
programVersion: 5.0.2
elementType: Cl S O O O O O O O C C C C C C C C C C C C C C C C C C C C H H H H H H H H H H H H H H H H H H H H H H H
charge: 0
multiplicity: 1
keywords: wb97x-d3
keywords: def2-TZVPP
keywords: def2/J RIJCOSX
keywords: DEFGRID2
keywords: scfconv7
keywords: smallprint printgap noloewdin
keywords: NOSOSCF
formula: C20H23ClO7S
InChI: InChI=1/C20H23ClO7S/c1-29(25,26)17-8-7-13(20(24)18-15(22)5-2-6-16(18)23)19(21)14(17)11-27-10-12-4-3-9-28-12/h7-8,12,22H,2-6,9-11H2,1H3
52 atoms
Cl 1.002827 -0.411893 -2.139818
S  -3.984568 -0.85881 0.272716
O  -1.898942 3.155549 0.906243
O  -2.347866 1.593374 -1.546876
O  1.847289 0.550516 1.061372
O  4.509862 -3.040066 -0.33166
O  2.048625 -3.365719 -0.100622
O  -4.561086 -0.927705 -1.069063
O  -4.455316 -1.841224 1.250335
C  -0.841585 2.651713 0.090359
C  0.31746 3.648866 0.216103
C  -0.037891 4.439516 1.469753
C  -1.552334 4.443686 1.395674
C  -1.289965 2.518116 -1.352257
C  3.055477 -1.274816 0.22962
C  5.392089 0.325246 0.738436
C  4.085649 1.029911 0.408948
C  5.538956 -0.939241 -0.088571
C  2.899478 0.128613 0.607457
C  4.318424 -1.786609 -0.049962
C  1.920087 -2.15308 0.102022
C  -1.412675 -0.563135 -0.887945
C  -1.97515 0.309785 -1.992169
C  0.506665 -1.658475 0.164737
C  -2.193325 -1.042093 0.17779
C  -0.060273 -0.904217 -0.858217
C  -0.295019 -2.09067 1.203492
C  -1.642269 -1.780892 1.212843
C  -4.277496 0.749376 0.951607
H  -0.557432 1.672638 0.487718
H  1.281664 3.147858 0.279082
H  0.349063 4.312685 -0.652391
H  0.384887 5.44356 1.479178
H  0.30134 3.91969 2.368103
H  -2.0407 4.592788 2.36008
H  -1.904345 5.229635 0.715924
H  -1.650538 3.491157 -1.699923
H  -0.425517 2.259787 -1.974847
H  6.234683 0.987943 0.54388
H  5.420986 0.075814 1.801614
H  4.083672 1.332689 -0.645413
H  3.954537 1.932733 1.00519
H  6.39969 -1.530872 0.226485
H  5.704636 -0.683141 -1.142353
H  -2.864771 -0.152538 -2.409741
H  -1.257938 0.383795 -2.810599
H  0.125029 -2.679998 2.007522
H  -2.251567 -2.140944 2.028465
H  -3.952702 1.510249 0.251438
H  -3.753071 0.843687 1.900021
H  -5.35316 0.827061 1.113685
H  3.622347 -3.502713 -0.299391
elementType: Cl S O C H
totalener: -2161.10025004 hartree
nucrepener: 3444.61229805 hartree
electener: -5605.71254808 hartree
oneelecener: -9820.13998058 hartree
twoeener: 4214.42743250 hartree
cpcmener: -0.05690916 hartree
kineticenergy: 2154.04190466 hartree
xcener: -162.933718486708 hartree
chargesum: 0.0000000
charge: -0.066736 0.874237 -0.428144 -0.380898 -0.491851 -0.309686 -0.453280 -0.561275 -0.569324 0.187949 -0.168699 -0.119850 0.024647 -0.027540 -0.326223 -0.132807 -0.077341 -0.076240 0.337602 0.315385 0.382570 -0.120242 -0.056167 0.125354 0.009550 0.015961 -0.137203 -0.097574 -0.269916 0.076321 0.071119 0.089872 0.080424 0.074806 0.088124 0.075417 0.115007 0.088971 0.085245 0.086377 0.100031 0.085960 0.100874 0.113835 0.146391 0.118273 0.153314 0.150660 0.131807 0.139829 0.152649 0.272436
qa: -0.0667 0.8742 -0.4281 -0.3809 -0.4919 -0.3097 -0.4533 -0.5613 -0.5693 0.1879 -0.1687 -0.1198 0.0246 -0.0275 -0.3262 -0.1328 -0.0773 -0.0762 0.3376 0.3154 0.3826 -0.1202 -0.0562 0.1254 0.0096 0.0160 -0.1372 -0.0976 -0.2699 0.0763 0.0711 0.0899 0.0804 0.0748 0.0881 0.0754 0.1150 0.0890 0.0852 0.0864 0.1000 0.0860 0.1009 0.1138 0.1464 0.1183 0.1533 0.1507 0.1318 0.1398 0.1526 0.2724
va: 1.2776 5.4913 1.9191 1.9173 1.9873 2.2553 2.0534 1.8950 1.9002 3.7786 3.9462 3.9161 3.9634 3.9473 3.4825 3.9495 3.8592 3.9418 3.9006 3.9279 3.7900 3.6543 3.8844 3.5568 3.6831 3.8696 4.0417 3.9581 3.8476 1.0321 1.0304 1.0121 1.0167 1.0136 0.9941 0.9906 0.9990 1.0127 1.0106 1.0068 1.0091 1.0244 1.0201 1.0057 1.0075 1.0074 1.0028 1.0177 1.0418 1.0091 1.0124 1.0527
dispcorr: -0.033987698 hartree
energy: -2161.134237735112
dipole: 10.19845 -4.82735 5.37111 29.85718 -27.30911 2.54807 9.94484 -9.55408 0.39076
magnitude: 5.95769 au
magnitude: 15.14326 debye
