program: Orca
programVersion: 5.0.2
elementType: Cl S O O O O O O O C C C C C C C C C C C C C C C C C C C C H H H H H H H H H H H H H H H H H H H H H H H
charge: 0
multiplicity: 1
keywords: wb97x-d3
keywords: def2-TZVPP
keywords: def2/J RIJCOSX
keywords: DEFGRID2
keywords: scfconv7
keywords: smallprint printgap noloewdin
keywords: NOSOSCF
formula: C20H23ClO7S
InChI: InChI=1/C20H23ClO7S/c1-29(25,26)17-8-7-13(20(24)18-15(22)5-2-6-16(18)23)19(21)14(17)11-27-10-12-4-3-9-28-12/h7-8,12,22H,2-6,9-11H2,1H3
52 atoms
Cl 0.740537 -0.427141 2.111853
S  -3.987008 -0.922099 -0.585067
O  -1.544966 4.547748 -0.322563
O  -1.505667 1.540275 1.668363
O  1.668894 0.425358 -1.079432
O  4.512242 -2.906181 0.590807
O  2.088126 -3.412212 0.29993
O  -4.639465 -1.443806 0.61719
O  -4.193797 0.487308 -0.918474
C  -1.066965 3.652416 0.676049
C  0.431349 3.515299 0.424184
C  0.524381 3.706565 -1.084921
C  -0.559994 4.741306 -1.336555
C  -1.830738 2.342409 0.551708
C  2.969561 -1.279679 -0.1296
C  5.21548 0.437214 -0.672258
C  3.859103 1.073367 -0.417653
C  5.418727 -0.767283 0.228581
C  2.735464 0.089791 -0.58854
C  4.25267 -1.688849 0.218104
C  1.889937 -2.226158 0.012822
C  -1.53323 -0.664628 0.660901
C  -2.134952 0.284564 1.680051
C  0.459797 -1.817439 -0.152849
C  -2.228665 -1.226391 -0.418438
C  -0.185876 -1.000103 0.766894
C  -0.264436 -2.353097 -1.201367
C  -1.608737 -2.058767 -1.33689
C  -4.539416 -1.893413 -1.961925
H  -1.273951 4.086328 1.660176
H  0.974112 4.307123 0.944505
H  0.835258 2.562186 0.766077
H  0.304662 2.777079 -1.611531
H  1.505748 4.04863 -1.411942
H  -0.158156 5.758186 -1.268419
H  -1.02783 4.633984 -2.318013
H  -2.907842 2.548477 0.530655
H  -1.569722 1.84142 -0.390611
H  5.290564 0.131809 -1.717915
H  6.008376 1.162258 -0.494584
H  3.686545 1.928705 -1.071244
H  3.807852 1.438005 0.615272
H  5.550733 -0.444055 1.268159
H  6.317923 -1.323945 -0.039393
H  -1.993215 -0.13543 2.677823
H  -3.211961 0.396702 1.550525
H  0.217207 -2.999221 -1.922748
H  -2.145711 -2.494344 -2.165896
H  -4.07437 -1.561256 -2.886546
H  -5.613626 -1.711994 -2.015102
H  -4.363237 -2.952017 -1.787638
H  3.657333 -3.427604 0.560754
elementType: Cl S O C H
totalener: -2161.10093002 hartree
nucrepener: 3429.24036456 hartree
electener: -5590.34129459 hartree
oneelecener: -9790.14882738 hartree
twoeener: 4199.80753279 hartree
cpcmener: -0.06518318 hartree
kineticenergy: 2154.04402953 hartree
xcener: -162.934166677216 hartree
chargesum: 0.0000000
charge: -0.062747 0.851408 -0.438258 -0.365822 -0.493578 -0.311593 -0.453749 -0.559113 -0.553557 0.225303 -0.141618 -0.186242 0.046165 -0.063218 -0.324982 -0.134460 -0.078680 -0.073395 0.331505 0.313457 0.385030 -0.074903 -0.013204 0.134223 0.050921 -0.088924 -0.155428 -0.085694 -0.261949 0.083641 0.095201 0.052811 0.075808 0.089483 0.081726 0.080945 0.089604 0.094048 0.086231 0.085032 0.089681 0.100687 0.113291 0.100415 0.136153 0.090869 0.152385 0.163479 0.147351 0.152348 0.149192 0.272718
qa: -0.0627 0.8514 -0.4383 -0.3658 -0.4936 -0.3116 -0.4537 -0.5591 -0.5536 0.2253 -0.1416 -0.1862 0.0462 -0.0632 -0.3250 -0.1345 -0.0787 -0.0734 0.3315 0.3135 0.3850 -0.0749 -0.0132 0.1342 0.0509 -0.0889 -0.1554 -0.0857 -0.2619 0.0836 0.0952 0.0528 0.0758 0.0895 0.0817 0.0809 0.0896 0.0940 0.0862 0.0850 0.0897 0.1007 0.1133 0.1004 0.1362 0.0909 0.1524 0.1635 0.1474 0.1523 0.1492 0.2727
va: 1.2810 5.5112 1.9416 1.9197 1.9718 2.2531 2.0505 1.8838 1.8992 3.8805 3.8861 3.9435 3.9506 3.9802 3.4902 3.9568 3.8681 3.9412 3.8869 3.9242 3.7927 3.6783 3.8847 3.5454 3.6478 4.0288 4.0989 3.8438 3.9045 1.0071 1.0109 1.0372 1.0178 1.0131 0.9915 0.9931 1.0151 0.9847 1.0069 1.0105 1.0227 1.0077 1.0063 1.0200 0.9966 1.0532 1.0034 0.9878 1.0018 1.0098 1.0008 1.0527
dispcorr: -0.033237267 hartree
energy: -2161.134167289533
dipole: 8.63241 -4.84072 3.79169 19.96672 -21.55782 -1.59111 -13.14806 11.08225 -2.06582
magnitude: 4.60175 au
magnitude: 11.69673 debye
