program: Orca
programVersion: 5.0.2
elementType: Cl S O O O O O O O C C C C C C C C C C C C C C C C C C C C H H H H H H H H H H H H H H H H H H H H H H H
charge: 0
multiplicity: 1
keywords: wb97x-d3
keywords: def2-TZVPP
keywords: def2/J RIJCOSX
keywords: DEFGRID2
keywords: scfconv7
keywords: smallprint printgap noloewdin
keywords: NOSOSCF
formula: C20H23ClO7S
InChI: InChI=1/C20H23ClO7S/c1-29(25,26)17-8-7-13(20(24)18-15(22)5-2-6-16(18)23)19(21)14(17)11-27-10-12-4-3-9-28-12/h7-8,12,22H,2-6,9-11H2,1H3
52 atoms
Cl 0.578641 -0.37806 2.073138
S  -4.067931 -1.321855 -0.740688
O  -0.986683 4.247039 -0.663248
O  -1.65393 1.480921 1.564403
O  1.46842 0.483667 -1.254454
O  4.53359 -2.556755 0.586785
O  2.146139 -3.220661 0.407829
O  -4.403794 -2.348084 -1.727353
O  -4.722855 -1.401381 0.565359
C  -0.963066 3.518655 0.562042
C  0.515609 3.348569 0.945538
C  1.236881 4.311608 0.006004
C  0.326512 4.279312 -1.204545
C  -1.698608 2.205484 0.353709
C  2.883826 -1.081156 -0.216918
C  5.010886 0.719855 -0.927299
C  3.626605 1.292888 -0.672346
C  5.307218 -0.404761 0.046666
C  2.559168 0.238752 -0.761397
C  4.196478 -1.388249 0.132264
C  1.871347 -2.081065 0.01443
C  -1.652293 -0.736081 0.570241
C  -2.316163 0.242368 1.523419
C  0.419376 -1.783922 -0.186403
C  -2.291654 -1.378952 -0.49841
C  -0.291494 -1.000011 0.712564
C  -0.245451 -2.381175 -1.241332
C  -1.605043 -2.189717 -1.390807
C  -4.403062 0.253201 -1.479822
H  -1.495088 4.111927 1.313498
H  0.692719 3.564997 1.998045
H  0.848549 2.325872 0.762625
H  2.254735 3.998932 -0.225548
H  1.279021 5.318278 0.426742
H  0.412848 5.154733 -1.850004
H  0.526653 3.387046 -1.812332
H  -2.738571 2.402473 0.061767
H  -1.224991 1.6471 -0.46584
H  5.074771 0.347446 -1.951872
H  5.763783 1.500018 -0.824185
H  3.390828 2.099527 -1.366679
H  3.57965 1.711441 0.340458
H  5.445689 -0.002717 1.057582
H  6.229934 -0.928368 -0.207712
H  -2.288284 -0.167989 2.535186
H  -3.368094 0.387992 1.277963
H  0.293506 -2.998901 -1.946898
H  -2.116459 -2.676407 -2.207948
H  -5.465781 0.271551 -1.725212
H  -3.81172 0.35649 -2.387141
H  -4.175788 1.059288 -0.788033
H  3.706789 -3.124411 0.623198
elementType: Cl S O C H
totalener: -2161.10150544 hartree
nucrepener: 3446.67415133 hartree
electener: -5607.77565677 hartree
oneelecener: -9823.29609834 hartree
twoeener: 4215.52044157 hartree
cpcmener: -0.06133852 hartree
kineticenergy: 2154.05094254 hartree
xcener: -162.935107545307 hartree
chargesum: -0.0000000
charge: -0.064117 0.867186 -0.433553 -0.361236 -0.492637 -0.311322 -0.452153 -0.568721 -0.559046 0.218372 -0.140076 -0.149059 0.026611 -0.069898 -0.306417 -0.133167 -0.085406 -0.073869 0.329247 0.310283 0.384984 -0.119383 -0.042083 0.125452 0.064138 -0.032683 -0.135032 -0.119684 -0.254214 0.097618 0.091039 0.027303 0.081196 0.086791 0.095559 0.065182 0.107778 0.090810 0.086713 0.085366 0.090540 0.099904 0.113395 0.101377 0.141318 0.105395 0.153076 0.153246 0.149907 0.144752 0.136963 0.272256
qa: -0.0641 0.8672 -0.4336 -0.3612 -0.4926 -0.3113 -0.4522 -0.5687 -0.5590 0.2184 -0.1401 -0.1491 0.0266 -0.0699 -0.3064 -0.1332 -0.0854 -0.0739 0.3292 0.3103 0.3850 -0.1194 -0.0421 0.1255 0.0641 -0.0327 -0.1350 -0.1197 -0.2542 0.0976 0.0910 0.0273 0.0812 0.0868 0.0956 0.0652 0.1078 0.0908 0.0867 0.0854 0.0905 0.0999 0.1134 0.1014 0.1413 0.1054 0.1531 0.1532 0.1499 0.1448 0.1370 0.2723
va: 1.2799 5.5134 1.9246 1.9161 1.9692 2.2533 2.0537 1.9064 1.8865 3.8576 3.9338 3.9154 3.9503 3.9812 3.4968 3.9606 3.8674 3.9430 3.8600 3.9188 3.7825 3.7159 3.8966 3.5582 3.6212 4.0006 4.0297 3.9750 3.8650 1.0045 1.0188 1.0322 1.0132 1.0135 0.9992 1.0066 1.0046 0.9873 1.0073 1.0105 1.0187 1.0037 1.0066 1.0202 0.9963 1.0301 1.0023 1.0179 1.0128 1.0061 1.0073 1.0551
dispcorr: -0.034692843 hartree
energy: -2161.136198283494
dipole: 11.53500 -7.38249 4.15252 28.72246 -26.62989 2.09257 -9.19045 8.32985 -0.86060
magnitude: 4.72894 au
magnitude: 12.02001 debye
