program: Orca
programVersion: 5.0.2
elementType: Cl S O O O O O O O C C C C C C C C C C C C C C C C C C C C H H H H H H H H H H H H H H H H H H H H H H H
charge: 0
multiplicity: 1
keywords: wb97x-d3
keywords: def2-TZVPP
keywords: def2/J RIJCOSX
keywords: DEFGRID2
keywords: scfconv7
keywords: smallprint printgap noloewdin
keywords: NOSOSCF
formula: C20H23ClO7S
InChI: InChI=1/C20H23ClO7S/c1-29(25,26)17-8-7-13(20(24)18-15(22)5-2-6-16(18)23)19(21)14(17)11-27-10-12-4-3-9-28-12/h7-8,12,22H,2-6,9-11H2,1H3
52 atoms
Cl 0.675058 -0.477549 2.062856
S  -4.025832 -1.244805 -0.718097
O  -1.347556 4.518245 -0.265157
O  -1.497195 1.444755 1.598414
O  1.526216 0.349048 -1.229556
O  4.560922 -2.75999 0.524403
O  2.157876 -3.403798 0.284761
O  -4.422207 -2.258228 -1.695691
O  -4.687237 -1.272222 0.587132
C  -0.942415 3.573622 0.721685
C  0.571667 3.427678 0.573659
C  0.799066 3.804544 -0.885634
C  -0.240981 4.890879 -1.07998
C  -1.709061 2.281981 0.481985
C  2.915737 -1.234547 -0.194143
C  4.795252 0.840304 0.28558
C  3.718239 1.113917 -0.746154
C  5.327736 -0.571117 0.116129
C  2.616903 0.0867 -0.743612
C  4.222885 -1.563442 0.149461
C  1.89123 -2.235489 -0.015844
C  -1.579056 -0.762468 0.581362
C  -2.196448 0.22755 1.554271
C  0.443277 -1.900327 -0.181962
C  -2.254477 -1.393417 -0.472984
C  -0.227698 -1.076557 0.712976
C  -0.258949 -2.492725 -1.215505
C  -1.611106 -2.247336 -1.356833
C  -4.258109 0.339171 -1.476695
H  -1.212711 3.956208 1.712181
H  1.085356 4.130528 1.23214
H  0.923263 2.426955 0.824529
H  0.60518 2.956868 -1.544357
H  1.810561 4.156924 -1.084661
H  0.150148 5.864667 -0.763484
H  -0.579735 4.986643 -2.113481
H  -2.7777 2.510691 0.373301
H  -1.374466 1.80389 -0.449989
H  5.608495 1.556965 0.180275
H  4.389183 0.961128 1.292335
H  4.15559 1.109192 -1.751256
H  3.268851 2.09892 -0.608456
H  6.059202 -0.828601 0.883454
H  5.836225 -0.672889 -0.850051
H  -2.161302 -0.200119 2.55894
H  -3.248388 0.406948 1.333045
H  0.246204 -3.145045 -1.914893
H  -2.149635 -2.725559 -2.161582
H  -3.960669 1.135279 -0.800077
H  -5.31948 0.433662 -1.707682
H  -3.674718 0.383657 -2.394124
H  3.743517 -3.337222 0.493941
elementType: Cl S O C H
totalener: -2161.10219007 hartree
nucrepener: 3435.99275133 hartree
electener: -5597.09494139 hartree
oneelecener: -9802.05933514 hartree
twoeener: 4204.96439375 hartree
cpcmener: -0.06084590 hartree
kineticenergy: 2154.04836342 hartree
xcener: -162.935042731924 hartree
chargesum: -0.0000000
charge: -0.063531 0.866790 -0.433143 -0.362365 -0.503890 -0.310577 -0.452831 -0.567776 -0.559038 0.209278 -0.144571 -0.184819 0.044605 -0.058639 -0.288852 -0.131868 -0.100088 -0.083112 0.324945 0.314756 0.381337 -0.076634 -0.050235 0.121655 0.053945 -0.053429 -0.132872 -0.119278 -0.258526 0.079244 0.098142 0.057648 0.073808 0.089498 0.079285 0.084000 0.098143 0.102973 0.083942 0.083861 0.112686 0.096793 0.100022 0.113023 0.142371 0.107115 0.152824 0.153771 0.141394 0.149289 0.145432 0.273499
qa: -0.0635 0.8668 -0.4331 -0.3624 -0.5039 -0.3106 -0.4528 -0.5678 -0.5590 0.2093 -0.1446 -0.1848 0.0446 -0.0586 -0.2889 -0.1319 -0.1001 -0.0831 0.3249 0.3148 0.3813 -0.0766 -0.0502 0.1217 0.0539 -0.0534 -0.1329 -0.1193 -0.2585 0.0792 0.0981 0.0576 0.0738 0.0895 0.0793 0.0840 0.0981 0.1030 0.0839 0.0839 0.1127 0.0968 0.1000 0.1130 0.1424 0.1071 0.1528 0.1538 0.1414 0.1493 0.1454 0.2735
va: 1.2804 5.5112 1.9464 1.9182 1.9612 2.2540 2.0509 1.9070 1.8860 3.8831 3.8747 3.9311 3.9662 3.9607 3.5109 3.9343 3.9146 3.9449 3.8634 3.8957 3.7802 3.6782 3.8925 3.5640 3.6395 3.9891 4.0335 3.9723 3.8609 1.0098 1.0104 1.0345 1.0262 1.0128 0.9925 0.9937 1.0054 0.9812 1.0127 1.0109 1.0093 1.0114 1.0213 1.0069 0.9959 1.0322 1.0036 1.0180 1.0059 1.0136 1.0063 1.0511
dispcorr: -0.034009867 hartree
energy: -2161.136199934469
dipole: 10.26435 -6.01150 4.25285 29.63245 -27.61778 2.01467 -9.62260 8.44932 -1.17328
magnitude: 4.84997 au
magnitude: 12.32764 debye
