program: Orca
programVersion: 5.0.2
elementType: Cl S O O O O O O O C C C C C C C C C C C C C C C C C C C C H H H H H H H H H H H H H H H H H H H H H H H
charge: 0
multiplicity: 1
keywords: wb97x-d3
keywords: def2-TZVPP
keywords: def2/J RIJCOSX
keywords: DEFGRID2
keywords: scfconv7
keywords: smallprint printgap noloewdin
keywords: NOSOSCF
formula: C20H23ClO7S
InChI: InChI=1/C20H23ClO7S/c1-29(25,26)17-8-7-13(20(24)18-15(22)5-2-6-16(18)23)19(21)14(17)11-27-10-12-4-3-9-28-12/h7-8,12,22H,2-6,9-11H2,1H3
52 atoms
Cl 0.919543 -0.46806 -2.133578
S  -4.024629 -1.00116 0.322342
O  0.176226 4.350137 -0.454194
O  -2.082484 1.646751 -1.237952
O  1.538763 0.357978 1.24768
O  4.572815 -2.824251 -0.369628
O  2.140931 -3.403753 -0.262208
O  -4.627925 -1.060274 -1.008735
O  -4.503878 -1.965439 1.312646
C  -1.075239 3.668529 -0.46731
C  -1.564191 3.666318 0.979279
C  -0.259569 3.697402 1.766739
C  0.612197 4.572986 0.884401
C  -0.833812 2.278378 -1.035666
C  2.937623 -1.266858 0.298048
C  5.086422 0.503117 1.02464
C  3.729838 1.102681 0.69068
C  5.387447 -0.673026 0.114446
C  2.635718 0.078175 0.788698
C  4.251736 -1.627965 0.023305
C  1.895555 -2.232212 0.042376
C  -1.471035 -0.662674 -0.844724
C  -2.011904 0.364279 -1.819651
C  0.450271 -1.84563 0.10016
C  -2.243428 -1.227905 0.184149
C  -0.125831 -1.02653 -0.865744
C  -0.346342 -2.378432 1.093819
C  -1.695511 -2.075862 1.13297
C  -4.248386 0.62039 0.999007
H  -1.764394 4.208011 -1.125696
H  -2.151786 4.564472 1.179497
H  -2.189226 2.805372 1.215691
H  0.165299 2.697263 1.864058
H  -0.375542 4.108009 2.769049
H  0.491398 5.631014 1.142051
H  1.674867 4.330599 0.959192
H  -0.294022 2.362443 -1.986924
H  -0.203413 1.707083 -0.343611
H  5.865603 1.256375 0.916976
H  5.100448 0.176131 2.066498
H  3.733076 1.471841 -0.341721
H  3.491512 1.94723 1.337459
H  6.28324 -1.209365 0.430878
H  5.57966 -0.320735 -0.90625
H  -3.019307 0.106964 -2.130955
H  -1.402999 0.380646 -2.726433
H  0.081388 -3.026229 1.847138
H  -2.304446 -2.50799 1.912867
H  -3.894796 1.371825 0.300228
H  -3.709886 0.69294 1.941592
H  -5.317548 0.74605 1.172633
H  3.736859 -3.371708 -0.415934
elementType: Cl S O C H
totalener: -2161.10140893 hartree
nucrepener: 3434.84231820 hartree
electener: -5595.94372713 hartree
oneelecener: -9799.70058081 hartree
twoeener: 4203.75685367 hartree
cpcmener: -0.05550066 hartree
kineticenergy: 2154.04751640 hartree
xcener: -162.935251995202 hartree
chargesum: -0.0000000
charge: -0.065717 0.869190 -0.437969 -0.369919 -0.496886 -0.310153 -0.452776 -0.559035 -0.565374 0.196175 -0.147527 -0.171826 0.042426 -0.025322 -0.321295 -0.136661 -0.070127 -0.072593 0.336623 0.310015 0.378212 -0.057682 -0.050630 0.180135 -0.046165 -0.041761 -0.144000 -0.098739 -0.275550 0.082643 0.093002 0.078257 0.073707 0.086928 0.083630 0.081125 0.094786 0.064914 0.085788 0.086468 0.098601 0.082611 0.101185 0.113427 0.150757 0.123788 0.153279 0.155017 0.143919 0.145064 0.153196 0.272843
qa: -0.0657 0.8692 -0.4380 -0.3699 -0.4969 -0.3102 -0.4528 -0.5590 -0.5654 0.1962 -0.1475 -0.1718 0.0424 -0.0253 -0.3213 -0.1367 -0.0701 -0.0726 0.3366 0.3100 0.3782 -0.0577 -0.0506 0.1801 -0.0462 -0.0418 -0.1440 -0.0987 -0.2756 0.0826 0.0930 0.0783 0.0737 0.0869 0.0836 0.0811 0.0948 0.0649 0.0858 0.0865 0.0986 0.0826 0.1012 0.1134 0.1508 0.1238 0.1533 0.1550 0.1439 0.1451 0.1532 0.2728
va: 1.2774 5.5025 1.9356 1.9188 1.9669 2.2550 2.0505 1.8926 1.9057 3.9441 3.9014 3.9478 3.9304 3.9672 3.4862 3.9466 3.8654 3.9421 3.8796 3.9264 3.8021 3.6414 3.7940 3.5048 3.7848 3.9495 4.0585 3.9397 3.8588 1.0060 1.0082 1.0195 1.0278 1.0175 0.9934 0.9934 1.0094 0.9815 1.0106 1.0071 1.0100 1.0267 1.0197 1.0062 1.0156 1.0139 1.0024 1.0172 1.0221 1.0030 1.0130 1.0511
dispcorr: -0.033639302 hartree
energy: -2161.135048234726
dipole: 7.72792 -3.77830 3.94962 28.79823 -26.92572 1.87252 13.48243 -12.05932 1.42311
magnitude: 4.59685 au
magnitude: 11.68427 debye
