program: Orca
programVersion: 5.0.2
elementType: Cl S O O O O O O O C C C C C C C C C C C C C C C C C C C C H H H H H H H H H H H H H H H H H H H H H H H
charge: 0
multiplicity: 1
keywords: wb97x-d3
keywords: def2-TZVPP
keywords: def2/J RIJCOSX
keywords: DEFGRID2
keywords: scfconv7
keywords: smallprint printgap noloewdin
keywords: NOSOSCF
formula: C20H23ClO7S
InChI: InChI=1/C20H23ClO7S/c1-29(25,26)17-8-7-13(20(24)18-15(22)5-2-6-16(18)23)19(21)14(17)11-27-10-12-4-3-9-28-12/h7-8,12,22H,2-6,9-11H2,1H3
52 atoms
Cl 0.772471 -0.840807 2.19982
S  -3.954633 -0.858138 -0.704978
O  -1.726515 3.409305 -0.5634
O  -2.173084 1.441407 1.425933
O  1.635042 0.572712 -0.94461
O  4.581763 -2.86548 0.253883
O  2.157684 -3.398186 -0.083541
O  -4.33331 -1.597979 -1.908949
O  -4.667411 -1.186195 0.529205
C  -1.099389 3.458997 0.714627
C  0.266651 4.139999 0.510664
C  0.224731 4.608709 -0.943108
C  -0.73582 3.610489 -1.560252
C  -0.915241 2.068601 1.281207
C  2.976403 -1.199048 -0.190327
C  4.914322 0.715762 0.624966
C  3.836739 1.193294 -0.328825
C  5.40612 -0.658701 0.207089
C  2.71382 0.204292 -0.505129
C  4.274527 -1.614411 0.086099
C  1.924994 -2.189034 -0.18098
C  -1.507888 -0.772878 0.712935
C  -2.122291 0.082954 1.803066
C  0.485842 -1.789284 -0.274379
C  -2.191521 -1.12537 -0.463152
C  -0.16867 -1.154322 0.775999
C  -0.22557 -2.119808 -1.410219
C  -1.566238 -1.79444 -1.503049
C  -4.149191 0.865971 -1.060507
H  -1.746672 4.045016 1.374363
H  0.425411 4.954994 1.214656
H  1.079967 3.422996 0.653591
H  1.203883 4.600006 -1.420192
H  -0.179009 5.619853 -1.017777
H  -1.226753 3.967884 -2.466509
H  -0.21987 2.672627 -1.802453
H  -0.264699 1.504851 0.605454
H  -0.403478 2.140222 2.248299
H  5.746608 1.41849 0.634994
H  4.52107 0.669808 1.643015
H  4.26708 1.366441 -1.321264
H  3.403506 2.142011 -0.009223
H  6.138289 -1.061977 0.908102
H  5.901485 -0.60501 -0.769745
H  -1.570394 -0.042004 2.736976
H  -3.144485 -0.222915 2.005769
H  0.264146 -2.62335 -2.232875
H  -2.108818 -2.067238 -2.395633
H  -3.518491 1.131075 -1.906056
H  -3.898272 1.463147 -0.191186
H  -5.197784 1.010758 -1.321563
H  3.751029 -3.408764 0.131488
elementType: Cl S O C H
totalener: -2161.10267304 hartree
nucrepener: 3454.02908641 hartree
electener: -5615.13175945 hartree
oneelecener: -9838.71651304 hartree
twoeener: 4223.58475359 hartree
cpcmener: -0.05672474 hartree
kineticenergy: 2154.06045360 hartree
xcener: -162.936960346595 hartree
chargesum: -0.0000000
charge: -0.064676 0.868113 -0.425880 -0.369572 -0.508813 -0.309404 -0.452351 -0.566877 -0.558806 0.228053 -0.208697 -0.115597 0.004397 -0.037297 -0.299812 -0.132448 -0.095147 -0.088754 0.340721 0.315534 0.376998 -0.072257 -0.034944 0.178055 -0.044618 -0.031644 -0.141772 -0.103198 -0.273378 0.099900 0.086757 0.082324 0.077527 0.079334 0.099530 0.073287 0.052469 0.103703 0.083931 0.084425 0.106502 0.095687 0.100191 0.113940 0.120350 0.148932 0.152613 0.154984 0.143583 0.142582 0.148086 0.273430
qa: -0.0647 0.8681 -0.4259 -0.3696 -0.5088 -0.3094 -0.4524 -0.5669 -0.5588 0.2281 -0.2087 -0.1156 0.0044 -0.0373 -0.2998 -0.1324 -0.0951 -0.0888 0.3407 0.3155 0.3770 -0.0723 -0.0349 0.1781 -0.0446 -0.0316 -0.1418 -0.1032 -0.2734 0.0999 0.0868 0.0823 0.0775 0.0793 0.0995 0.0733 0.0525 0.1037 0.0839 0.0844 0.1065 0.0957 0.1002 0.1139 0.1203 0.1489 0.1526 0.1550 0.1436 0.1426 0.1481 0.2734
va: 1.2789 5.5062 1.9227 1.9238 1.9545 2.2558 2.0513 1.9039 1.8937 3.8578 3.9655 3.8947 3.9439 3.9923 3.5142 3.9289 3.9253 3.9463 3.8464 3.8938 3.7956 3.6684 3.7861 3.5130 3.7778 3.9541 4.0524 3.9439 3.8652 1.0061 1.0176 1.0122 1.0175 1.0122 0.9988 1.0038 0.9757 1.0028 1.0133 1.0103 1.0090 1.0126 1.0212 1.0061 1.0154 1.0136 1.0025 1.0182 1.0052 1.0280 1.0159 1.0506
dispcorr: -0.034025532 hartree
energy: -2161.136698567959
dipole: 11.88627 -6.42813 5.45813 31.42055 -28.98849 2.43206 -6.01188 6.08864 0.07676
magnitude: 5.97596 au
magnitude: 15.18967 debye
