program: Orca
programVersion: 5.0.2
elementType: Cl S O O O O O O O C C C C C C C C C C C C C C C C C C C C H H H H H H H H H H H H H H H H H H H H H H H
charge: 0
multiplicity: 1
keywords: wb97x-d3
keywords: def2-TZVPP
keywords: def2/J RIJCOSX
keywords: DEFGRID2
keywords: scfconv7
keywords: smallprint printgap noloewdin
keywords: NOSOSCF
formula: C20H23ClO7S
InChI: InChI=1/C20H23ClO7S/c1-29(25,26)17-8-7-13(20(24)18-15(22)5-2-6-16(18)23)19(21)14(17)11-27-10-12-4-3-9-28-12/h7-8,12,22H,2-6,9-11H2,1H3
52 atoms
Cl 0.985072 -0.388999 -2.142908
S  -3.999445 -0.814199 0.284978
O  -1.605073 2.815397 0.90827
O  -2.497636 1.526014 -1.592459
O  1.70706 0.568007 1.284876
O  4.565732 -2.766851 -0.336689
O  2.118232 -3.239617 -0.132331
O  -4.574851 -0.851324 -1.056339
O  -4.47029 -1.806996 1.250461
C  -0.749953 2.561489 -0.189654
C  0.300968 3.667088 -0.123431
C  0.412593 3.953499 1.382153
C  -0.770569 3.183616 1.991057
C  -1.538508 2.560579 -1.480363
C  3.01605 -1.122153 0.325672
C  5.052545 0.818813 -0.091059
C  3.979862 1.149858 0.929146
C  5.47499 -0.632373 0.050384
C  2.79515 0.221493 0.857078
C  4.302271 -1.545866 0.013746
C  1.926217 -2.048453 0.123617
C  -1.43614 -0.557211 -0.899922
C  -2.012498 0.27944 -2.02596
C  0.494152 -1.610496 0.174639
C  -2.209419 -1.00975 0.180756
C  -0.08088 -0.889257 -0.864929
C  -0.303976 -2.036636 1.219054
C  -1.652176 -1.73292 1.224994
C  -4.290629 0.780942 0.999729
H  -0.250099 1.596682 -0.049317
H  1.24315 3.351531 -0.5706
H  -0.040163 4.552506 -0.665934
H  0.34619 5.021359 1.587671
H  1.357726 3.602723 1.795754
H  -0.418025 2.292722 2.524418
H  -1.359883 3.777828 2.690957
H  -2.090581 3.501018 -1.562732
H  -0.83391 2.525309 -2.32084
H  4.675557 0.995559 -1.101138
H  5.916335 1.469081 0.044282
H  3.621805 2.175065 0.822693
H  4.391397 1.067307 1.942205
H  5.987905 -0.788723 1.007152
H  6.177971 -0.930797 -0.729456
H  -2.844662 -0.252269 -2.481131
H  -1.268898 0.411071 -2.813661
H  0.122535 -2.606244 2.034133
H  -2.260583 -2.080878 2.047277
H  -3.770794 0.855175 1.952388
H  -5.367108 0.847672 1.163665
H  -3.969922 1.56179 0.320117
H  3.713472 -3.290832 -0.304705
elementType: Cl S O C H
totalener: -2161.10371580 hartree
nucrepener: 3489.65478158 hartree
electener: -5650.75849738 hartree
oneelecener: -9910.06298465 hartree
twoeener: 4259.30448727 hartree
cpcmener: -0.04561795 hartree
kineticenergy: 2154.05701684 hartree
xcener: -162.933076313727 hartree
chargesum: 0.0000000
charge: -0.069272 0.870180 -0.397674 -0.367084 -0.477367 -0.301833 -0.431558 -0.546414 -0.557780 0.196526 -0.176685 -0.141762 0.023773 0.008774 -0.301668 -0.131755 -0.102815 -0.085277 0.333300 0.308329 0.343721 -0.082188 -0.036020 0.126812 -0.044627 0.046283 -0.131392 -0.108485 -0.275628 0.009409 0.083948 0.087324 0.082521 0.073885 0.070026 0.094639 0.100207 0.093541 0.083510 0.083368 0.092172 0.105488 0.111298 0.100849 0.142880 0.111258 0.148964 0.147255 0.134994 0.148006 0.137698 0.266345
qa: -0.0693 0.8702 -0.3977 -0.3671 -0.4774 -0.3018 -0.4316 -0.5464 -0.5578 0.1965 -0.1767 -0.1418 0.0238 0.0088 -0.3017 -0.1318 -0.1028 -0.0853 0.3333 0.3083 0.3437 -0.0822 -0.0360 0.1268 -0.0446 0.0463 -0.1314 -0.1085 -0.2756 0.0094 0.0839 0.0873 0.0825 0.0739 0.0700 0.0946 0.1002 0.0935 0.0835 0.0834 0.0922 0.1055 0.1113 0.1008 0.1429 0.1113 0.1490 0.1473 0.1350 0.1480 0.1377 0.2663
va: 1.2741 5.5108 1.9450 1.9338 2.0003 2.2646 2.0764 1.9158 1.9159 3.8334 3.9306 3.9026 3.9172 3.9327 3.5079 3.9290 3.9149 3.9394 3.8803 3.8960 3.8254 3.6681 3.9029 3.5822 3.7380 3.8722 4.0316 3.9645 3.8647 1.0628 1.0188 1.0156 1.0142 1.0217 1.0033 0.9931 1.0127 1.0087 1.0111 1.0132 1.0137 1.0091 1.0073 1.0212 1.0061 1.0101 1.0021 1.0197 1.0086 1.0137 1.0294 1.0593
dispcorr: -0.035603536 hartree
energy: -2161.139319339696
dipole: 11.15724 -6.02537 5.13187 28.22516 -25.94278 2.28238 10.14836 -9.48633 0.66203
magnitude: 5.65540 au
magnitude: 14.37489 debye
