program: Orca
programVersion: 5.0.2
elementType: Cl S O O O O O O O C C C C C C C C C C C C C C C C C C C C H H H H H H H H H H H H H H H H H H H H H H H
charge: 0
multiplicity: 1
keywords: wb97x-d3
keywords: def2-TZVPP
keywords: def2/J RIJCOSX
keywords: DEFGRID2
keywords: scfconv7
keywords: smallprint printgap noloewdin
keywords: NOSOSCF
formula: C20H23ClO7S
InChI: InChI=1/C20H23ClO7S/c1-29(25,26)17-8-7-13(20(24)18-15(22)5-2-6-16(18)23)19(21)14(17)11-27-10-12-4-3-9-28-12/h7-8,12,22H,2-6,9-11H2,1H3
52 atoms
Cl 0.956558 -0.424024 -2.25055
S  -3.96215 -0.878369 0.29319
O  -1.92354 3.093592 1.029846
O  -2.300904 1.656271 -1.447352
O  1.850864 0.548028 0.930521
O  4.526576 -3.050445 -0.435841
O  2.063105 -3.350574 -0.323564
O  -4.5504 -0.956192 -1.040699
O  -4.399624 -1.863672 1.279882
C  -0.824917 2.606895 0.269409
C  0.305903 3.6113 0.4900
C  -0.45344 4.915694 0.710698
C  -1.699653 4.437806 1.441825
C  -1.195699 2.509277 -1.202998
C  3.076859 -1.290258 0.148364
C  5.412311 0.244457 0.839173
C  4.140149 0.987098 0.466508
C  5.582342 -0.99379 -0.022225
C  2.922313 0.107114 0.554306
C  4.342552 -1.81271 -0.095425
C  1.937259 -2.154131 -0.044399
C  -1.41721 -0.545858 -0.912981
C  -1.998051 0.381798 -1.961275
C  0.525405 -1.6633 0.067965
C  -2.169333 -1.037941 0.167493
C  -0.069907 -0.902199 -0.932741
C  -0.243556 -2.096976 1.130061
C  -1.591145 -1.789375 1.177843
C  -4.276566 0.726604 0.977526
H  -0.563345 1.615823 0.649366
H  0.880216 3.345114 1.379192
H  1.002133 3.653538 -0.348647
H  -0.709585 5.384634 -0.24121
H  0.109986 5.643338 1.294447
H  -1.553716 4.468114 2.527548
H  -2.581502 5.040461 1.211217
H  -1.469677 3.500522 -1.578938
H  -0.317826 2.187054 -1.77315
H  6.276906 0.896012 0.714909
H  5.379827 -0.041096 1.893077
H  4.205414 1.339324 -0.570156
H  3.988943 1.865248 1.094775
H  6.403574 -1.62028 0.330333
H  5.83073 -0.708553 -1.051834
H  -2.924647 -0.028877 -2.35219
H  -1.315373 0.460439 -2.809403
H  0.200967 -2.690324 1.918262
H  -2.182308 -2.158364 2.003376
H  -5.346891 0.76609 1.184058
H  -4.005858 1.497586 0.2651
H  -3.720176 0.842157 1.904949
H  3.627957 -3.496131 -0.478704
elementType: Cl S O C H
totalener: -2161.10251641 hartree
nucrepener: 3440.55266920 hartree
electener: -5601.65518561 hartree
oneelecener: -9811.97885087 hartree
twoeener: 4210.32366526 hartree
cpcmener: -0.04538304 hartree
kineticenergy: 2154.05231052 hartree
xcener: -162.933104309539 hartree
chargesum: 0.0000000
charge: -0.072129 0.863631 -0.416233 -0.367807 -0.464179 -0.303419 -0.432968 -0.545760 -0.553479 0.198306 -0.162966 -0.159858 0.037638 -0.030305 -0.321108 -0.136775 -0.085858 -0.078916 0.330693 0.300996 0.361002 -0.130770 -0.065104 0.140768 0.005432 0.030082 -0.139712 -0.093033 -0.274942 0.072084 0.084608 0.081804 0.079493 0.081211 0.077781 0.077043 0.117514 0.081154 0.084084 0.086102 0.097958 0.087679 0.100960 0.111460 0.146487 0.115403 0.149221 0.148404 0.151622 0.135291 0.133706 0.265705
qa: -0.0721 0.8636 -0.4162 -0.3678 -0.4642 -0.3034 -0.4330 -0.5458 -0.5535 0.1983 -0.1630 -0.1599 0.0376 -0.0303 -0.3211 -0.1368 -0.0859 -0.0789 0.3307 0.3010 0.3610 -0.1308 -0.0651 0.1408 0.0054 0.0301 -0.1397 -0.0930 -0.2749 0.0721 0.0846 0.0818 0.0795 0.0812 0.0778 0.0770 0.1175 0.0812 0.0841 0.0861 0.0980 0.0877 0.1010 0.1115 0.1465 0.1154 0.1492 0.1484 0.1516 0.1353 0.1337 0.2657
va: 1.2712 5.5178 1.9465 1.9247 2.0270 2.2623 2.0794 1.9140 1.9199 3.8015 3.9424 3.9718 3.9339 3.9339 3.4991 3.9396 3.8747 3.9395 3.9073 3.9309 3.8132 3.6674 3.8874 3.5606 3.6830 3.8855 4.0425 3.9548 3.8531 1.0269 1.0178 1.0135 1.0056 1.0156 0.9886 0.9923 0.9996 1.0155 1.0113 1.0070 1.0091 1.0238 1.0202 1.0066 1.0092 1.0065 1.0030 1.0195 1.0119 1.0375 1.0126 1.0632
dispcorr: -0.033975243 hartree
energy: -2161.136491656757
dipole: 9.72995 -4.66908 5.06087 30.28772 -27.82274 2.46498 10.83670 -10.29458 0.54212
magnitude: 5.65530 au
magnitude: 14.37463 debye
