program: Orca
programVersion: 5.0.2
elementType: Cl S O O O O O O O C C C C C C C C C C C C C C C C C C C C H H H H H H H H H H H H H H H H H H H H H H H
charge: 0
multiplicity: 1
keywords: wb97x-d3
keywords: def2-TZVPP
keywords: def2/J RIJCOSX
keywords: DEFGRID2
keywords: scfconv7
keywords: smallprint printgap noloewdin
keywords: NOSOSCF
formula: C20H23ClO7S
InChI: InChI=1/C20H23ClO7S/c1-29(25,26)17-8-7-13(20(24)18-15(22)5-2-6-16(18)23)19(21)14(17)11-27-10-12-4-3-9-28-12/h7-8,12,22H,2-6,9-11H2,1H3
52 atoms
Cl 1.512876 0.847552 0.285213
S  -3.612402 -1.004641 -0.532075
O  -3.016724 4.020651 -0.235276
O  -1.292278 1.965347 0.963856
O  1.915256 -1.816367 -1.907614
O  4.757017 -2.490431 1.767224
O  2.326375 -2.193915 2.162144
O  -3.700234 -0.219668 -1.761287
O  -4.210156 -2.337254 -0.529223
C  -2.242854 4.217829 0.944329
C  -1.897701 5.706839 0.990172
C  -3.00229 6.330227 0.146081
C  -3.22242 5.256042 -0.904766
C  -1.004928 3.34635 0.936609
C  3.249626 -2.060675 0.009863
C  5.520176 -1.558919 -1.646984
C  4.2409 -2.005463 -2.330294
C  5.730402 -2.346225 -0.367072
C  3.030902 -1.932609 -1.43287
C  4.529041 -2.292767 0.506811
C  2.161868 -1.992643 0.95445
C  -0.99534 -0.113224 -0.067364
C  -1.379805 1.328369 -0.289972
C  0.757202 -1.701474 0.528645
C  -1.88685 -1.191345 -0.084684
C  0.326999 -0.412176 0.252419
C  -0.162613 -2.73508 0.52871
C  -1.483188 -2.484908 0.209417
C  -4.33493 -0.094646 0.81052
H  -2.861064 3.944087 1.809411
H  -1.861022 6.087706 2.010269
H  -0.920214 5.891029 0.533983
H  -2.723642 7.289447 -0.289662
H  -3.905796 6.479897 0.741326
H  -4.228561 5.265533 -1.329569
H  -2.510688 5.36932 -1.731841
H  -0.37482 3.600697 0.074073
H  -0.423796 3.56704 1.837344
H  6.371966 -1.701577 -2.311427
H  5.4704 -0.49193 -1.41735
H  4.338126 -3.049915 -2.650379
H  4.038032 -1.422114 -3.229439
H  6.594237 -1.987681 0.195447
H  5.923163 -3.401343 -0.596095
H  -2.37098 1.426501 -0.72857
H  -0.68868 1.773709 -1.015579
H  0.15299 -3.743712 0.760708
H  -2.188183 -3.303371 0.200591
H  -5.396261 0.017699 0.585659
H  -3.879536 0.887732 0.912881
H  -4.212572 -0.660994 1.731801
H  3.87681 -2.449594 2.250347
elementType: Cl S O C H
totalener: -2161.10750469 hartree
nucrepener: 3295.92340063 hartree
electener: -5457.03090532 hartree
oneelecener: -9523.52442677 hartree
twoeener: 4066.49352145 hartree
cpcmener: -0.05060332 hartree
kineticenergy: 2154.06615635 hartree
xcener: -162.931834917758 hartree
chargesum: -0.0000000
charge: -0.069102 0.858646 -0.397682 -0.364630 -0.459985 -0.303928 -0.433620 -0.540800 -0.552915 0.165007 -0.181368 -0.130353 0.026745 0.007106 -0.317550 -0.133218 -0.100933 -0.089290 0.325132 0.313221 0.357972 -0.011055 -0.087107 0.136342 0.011524 -0.049233 -0.142321 -0.107332 -0.241433 0.083889 0.085245 0.085663 0.079892 0.078906 0.083078 0.072301 0.072747 0.094537 0.082951 0.084996 0.103581 0.087374 0.100073 0.111660 0.093959 0.131896 0.147473 0.155803 0.139067 0.129070 0.142516 0.265484
qa: -0.0691 0.8586 -0.3977 -0.3646 -0.4600 -0.3039 -0.4336 -0.5408 -0.5529 0.1650 -0.1814 -0.1304 0.0267 0.0071 -0.3175 -0.1332 -0.1009 -0.0893 0.3251 0.3132 0.3580 -0.0111 -0.0871 0.1363 0.0115 -0.0492 -0.1423 -0.1073 -0.2414 0.0839 0.0852 0.0857 0.0799 0.0789 0.0831 0.0723 0.0727 0.0945 0.0830 0.0850 0.1036 0.0874 0.1001 0.1117 0.0940 0.1319 0.1475 0.1558 0.1391 0.1291 0.1425 0.2655
va: 1.2765 5.5358 1.9610 1.8842 2.0317 2.2604 2.0786 1.9072 1.9286 3.8589 3.9645 3.9174 3.9644 3.9350 3.4967 3.9214 3.9052 3.9415 3.9210 3.8892 3.8021 3.7280 3.8964 3.5560 3.7358 4.0331 4.0436 3.9361 3.8709 1.0065 1.0158 1.0090 1.0159 1.0076 0.9914 0.9877 1.0060 1.0032 1.0132 1.0089 1.0070 1.0285 1.0215 1.0068 1.0504 0.9968 1.0043 1.0185 1.0136 1.0148 1.0087 1.0649
dispcorr: -0.029356365 hartree
energy: -2161.136861056503
dipole: -2.71725 6.03997 3.32273 25.61405 -24.04331 1.57074 -1.68802 2.88201 1.19398
magnitude: 3.86437 au
magnitude: 9.82244 debye
