program: Orca
programVersion: 5.0.2
elementType: Cl S O O O O O O O C C C C C C C C C C C C C C C C C C C C H H H H H H H H H H H H H H H H H H H H H H H
charge: 0
multiplicity: 1
keywords: wb97x-d3
keywords: def2-TZVPP
keywords: def2/J RIJCOSX
keywords: DEFGRID2
keywords: scfconv7
keywords: smallprint printgap noloewdin
keywords: NOSOSCF
formula: C20H23ClO7S
InChI: InChI=1/C20H23ClO7S/c1-29(25,26)17-8-7-13(20(24)18-15(22)5-2-6-16(18)23)19(21)14(17)11-27-10-12-4-3-9-28-12/h7-8,12,22H,2-6,9-11H2,1H3
52 atoms
Cl 1.203787 1.0173 1.363864
S  -3.842731 -1.001393 0.191354
O  -1.784258 2.134732 -1.756991
O  -2.538492 2.118871 0.979355
O  1.554811 -2.371959 1.611059
O  4.849536 -0.627024 -1.23586
O  2.450988 -0.354916 -1.843518
O  -4.210897 -2.27368 -0.42696
O  -4.189078 -0.815594 1.597693
C  -1.978483 3.347199 -1.042281
C  -0.981266 4.346343 -1.630547
C  0.144953 3.435205 -2.108278
C  -0.625393 2.212767 -2.577724
C  -1.722737 3.14399 0.440957
C  3.110436 -1.364953 0.169106
C  5.055851 -1.687976 2.227216
C  3.81711 -2.561511 2.296589
C  5.545554 -1.590844 0.794022
C  2.718048 -2.099233 1.374476
C  4.455309 -1.175797 -0.128439
C  2.131681 -0.84299 -0.75438
C  -1.272168 0.072973 0.713077
C  -1.863933 1.092477 1.665356
C  0.666819 -0.858601 -0.449036
C  -2.064388 -0.815158 -0.03375
C  0.099795 0.006518 0.480994
C  -0.154759 -1.670798 -1.204858
C  -1.519637 -1.667563 -0.98036
C  -4.582418 0.292634 -0.769165
H  -3.013835 3.674427 -1.188686
H  -1.426062 4.881421 -2.471676
H  -0.654921 5.090913 -0.902911
H  0.817747 3.180806 -1.286226
H  0.74581 3.876792 -2.902961
H  -0.921668 2.317897 -3.628417
H  -0.053026 1.28641 -2.485559
H  -0.661201 2.937044 0.606879
H  -1.94613 4.081358 0.963348
H  4.831094 -0.688934 2.607693
H  5.84302 -2.098427 2.859029
H  3.416776 -2.616954 3.309779
H  4.069558 -3.587636 2.003253
H  5.916272 -2.564119 0.450756
H  6.377259 -0.890898 0.694535
H  -1.086695 1.4973 2.315048
H  -2.585852 0.613595 2.320273
H  0.266498 -2.332326 -1.950197
H  -2.144162 -2.33627 -1.55464
H  -5.658859 0.118246 -0.748449
H  -4.223544 0.238493 -1.794918
H  -4.355039 1.259024 -0.331374
H  4.035121 -0.410522 -1.780043
elementType: Cl S O C H
totalener: -2161.10308675 hartree
nucrepener: 3465.15016597 hartree
electener: -5626.25325273 hartree
oneelecener: -9861.69132615 hartree
twoeener: 4235.43807343 hartree
cpcmener: -0.04746092 hartree
kineticenergy: 2154.05696252 hartree
xcener: -162.935153043787 hartree
chargesum: -0.0000000
charge: -0.073850 0.863295 -0.400102 -0.374798 -0.457718 -0.305179 -0.443547 -0.554166 -0.546918 0.186934 -0.168016 -0.145304 0.026621 -0.039328 -0.297015 -0.133784 -0.097641 -0.087699 0.317642 0.311017 0.351924 -0.054987 -0.032062 0.115714 -0.047739 0.018829 -0.132423 -0.090872 -0.275616 0.088855 0.090028 0.081050 0.069255 0.084768 0.090827 0.067925 0.083746 0.100354 0.084756 0.083615 0.087527 0.102539 0.111297 0.099708 0.111438 0.147535 0.145863 0.148130 0.150261 0.134757 0.137538 0.265018
qa: -0.0739 0.8633 -0.4001 -0.3748 -0.4577 -0.3052 -0.4435 -0.5542 -0.5469 0.1869 -0.1680 -0.1453 0.0266 -0.0393 -0.2970 -0.1338 -0.0976 -0.0877 0.3176 0.3110 0.3519 -0.0550 -0.0321 0.1157 -0.0477 0.0188 -0.1324 -0.0909 -0.2756 0.0889 0.0900 0.0811 0.0693 0.0848 0.0908 0.0679 0.0837 0.1004 0.0848 0.0836 0.0875 0.1025 0.1113 0.0997 0.1114 0.1475 0.1459 0.1481 0.1503 0.1348 0.1375 0.2650
va: 1.2679 5.5155 1.9499 1.9242 2.0329 2.2615 2.0588 1.9195 1.9141 3.8420 3.9523 3.9385 3.9169 3.9450 3.4683 3.9202 3.8959 3.9414 3.9373 3.8994 3.8058 3.6973 3.8440 3.4766 3.7342 3.8066 4.0151 3.9605 3.8545 1.0013 1.0085 1.0178 1.0170 1.0179 0.9970 1.0061 1.0016 1.0097 1.0099 1.0134 1.0291 1.0074 1.0073 1.0213 1.0081 1.0087 1.0056 1.0191 1.0136 1.0126 1.0289 1.0649
dispcorr: -0.034671604 hartree
energy: -2161.137758357728
dipole: 5.68852 -1.48040 4.20811 14.80040 -12.86018 1.94022 -7.09279 6.16199 -0.93080
magnitude: 4.72642 au
magnitude: 12.01360 debye
