program: Orca
programVersion: 5.0.2
elementType: Cl S O O O O O O O C C C C C C C C C C C C C C C C C C C C H H H H H H H H H H H H H H H H H H H H H H H
charge: 0
multiplicity: 1
keywords: wb97x-d3
keywords: def2-TZVPP
keywords: def2/J RIJCOSX
keywords: DEFGRID2
keywords: scfconv7
keywords: smallprint printgap noloewdin
keywords: NOSOSCF
formula: C20H23ClO7S
InChI: InChI=1/C20H23ClO7S/c1-29(25,26)17-8-7-13(20(24)18-15(22)5-2-6-16(18)23)19(21)14(17)11-27-10-12-4-3-9-28-12/h7-8,12,22H,2-6,9-11H2,1H3
52 atoms
Cl 0.886152 0.184802 -1.560877
S  -4.043595 -1.409261 0.305374
O  -1.614618 5.256642 -0.293236
O  -1.661389 1.655905 -0.299112
O  1.54779 -0.236954 1.680682
O  4.576814 -2.875988 -0.73494
O  2.149697 -3.356408 -0.916766
O  -4.636343 -1.160437 -1.00639
O  -4.506975 -2.576083 1.0519
C  -1.370577 3.951507 0.218766
C  0.120092 3.898389 0.55799
C  0.709912 4.944844 -0.380991
C  -0.398052 5.98181 -0.40908
C  -1.792878 2.948282 -0.844315
C  2.952459 -1.532744 0.316659
C  4.988701 0.410701 0.707418
C  3.822738 0.431799 1.677845
C  5.417883 -1.021451 0.444311
C  2.666884 -0.432815 1.240427
C  4.267523 -1.845628 -0.011168
C  1.904525 -2.341931 -0.255808
C  -1.501076 -0.647166 -0.600824
C  -2.035381 0.631673 -1.188431
C  0.455463 -2.010714 -0.087791
C  -2.266467 -1.566969 0.124251
C  -0.13386 -0.900927 -0.679763
C  -0.342955 -2.909562 0.597794
C  -1.701581 -2.685485 0.715648
C  -4.273136 0.0141 1.340286
H  -1.987181 3.795329 1.111576
H  0.280301 4.188486 1.598502
H  0.548131 2.904357 0.427628
H  0.881413 4.527462 -1.375684
H  1.654314 5.357441 -0.026926
H  -0.294787 6.683189 0.427964
H  -0.421299 6.567465 -1.330875
H  -2.831785 3.143413 -1.144436
H  -1.168363 3.055781 -1.743311
H  4.702616 0.885728 -0.23389
H  5.826136 0.980254 1.109271
H  3.448953 1.444215 1.83965
H  4.148043 0.060106 2.656901
H  5.813881 -1.476111 1.360152
H  6.212635 -1.080081 -0.301218
H  -3.11641 0.606396 -1.335032
H  -1.604196 0.787487 -2.184265
H  0.096008 -3.785612 1.056313
H  -2.306647 -3.389512 1.268101
H  -3.815352 -0.173075 2.3098
H  -5.348417 0.151313 1.461205
H  -3.838947 0.90429 0.892069
H  3.725248 -3.355297 -0.967245
elementType: Cl S O C H
totalener: -2161.10801791 hartree
nucrepener: 3355.50705222 hartree
electener: -5516.61507013 hartree
oneelecener: -9641.31137804 hartree
twoeener: 4124.69630790 hartree
cpcmener: -0.04883887 hartree
kineticenergy: 2154.06317500 hartree
xcener: -162.931429282505 hartree
chargesum: 0.0000000
charge: -0.068197 0.856240 -0.414943 -0.349046 -0.462290 -0.305079 -0.434691 -0.540795 -0.551272 0.192668 -0.138752 -0.160436 0.045149 -0.048889 -0.305984 -0.133042 -0.100254 -0.090981 0.309810 0.313953 0.378104 -0.022859 -0.079442 0.134313 0.001897 -0.061430 -0.143528 -0.105453 -0.243980 0.078846 0.092329 0.056356 0.075310 0.082649 0.074981 0.080593 0.091772 0.094223 0.084546 0.083026 0.090675 0.104161 0.110772 0.098852 0.123481 0.122207 0.147603 0.156052 0.142912 0.139420 0.132172 0.266271
qa: -0.0682 0.8562 -0.4149 -0.3490 -0.4623 -0.3051 -0.4347 -0.5408 -0.5513 0.1927 -0.1388 -0.1604 0.0451 -0.0489 -0.3060 -0.1330 -0.1003 -0.0910 0.3098 0.3140 0.3781 -0.0229 -0.0794 0.1343 0.0019 -0.0614 -0.1435 -0.1055 -0.2440 0.0788 0.0923 0.0564 0.0753 0.0826 0.0750 0.0806 0.0918 0.0942 0.0845 0.0830 0.0907 0.1042 0.1108 0.0989 0.1235 0.1222 0.1476 0.1561 0.1429 0.1394 0.1322 0.2663
va: 1.2742 5.5391 1.9655 1.8966 2.0171 2.2595 2.0773 1.9087 1.9301 3.9134 3.8969 3.9508 3.9420 3.9471 3.4710 3.9201 3.9018 3.9408 3.9244 3.8974 3.7844 3.7427 3.8800 3.5394 3.7499 4.0298 4.0582 3.9353 3.8632 1.0035 1.0080 1.0392 1.0075 1.0160 0.9909 0.9937 1.0051 0.9999 1.0105 1.0135 1.0230 1.0087 1.0070 1.0217 1.0258 1.0017 1.0067 1.0191 1.0089 1.0136 1.0168 1.0633
dispcorr: -0.030464024 hartree
energy: -2161.138481933826
dipole: 9.54138 -5.32712 4.21426 30.24363 -28.51426 1.72937 8.76190 -7.71147 1.05043
magnitude: 4.67483 au
magnitude: 11.88249 debye
