program: Orca
programVersion: 5.0.2
elementType: Cl S O O O O O O O C C C C C C C C C C C C C C C C C C C C H H H H H H H H H H H H H H H H H H H H H H H
charge: 0
multiplicity: 1
keywords: wb97x-d3
keywords: def2-TZVPP
keywords: def2/J RIJCOSX
keywords: DEFGRID2
keywords: scfconv7
keywords: smallprint printgap noloewdin
keywords: NOSOSCF
formula: C20H23ClO7S
InChI: InChI=1/C20H23ClO7S/c1-29(25,26)17-8-7-13(20(24)18-15(22)5-2-6-16(18)23)19(21)14(17)11-27-10-12-4-3-9-28-12/h7-8,12,22H,2-6,9-11H2,1H3
52 atoms
Cl 0.785714 0.08586 -1.682533
S  -4.101523 -1.480428 0.31096
O  -1.091373 5.145031 -0.530161
O  -1.674427 1.593619 -0.397483
O  1.404448 -0.067399 1.58609
O  4.567603 -2.743551 -0.609294
O  2.167183 -3.349538 -0.765772
O  -4.693804 -1.254591 -1.005127
O  -4.547127 -2.645879 1.070183
C  -1.082861 3.832519 0.020776
C  0.375978 3.509937 0.349279
C  0.988647 4.89543 0.517154
C  0.220999 5.688459 -0.525622
C  -1.712874 2.876984 -0.977132
C  2.875389 -1.399683 0.328133
C  4.828718 0.653178 0.600293
C  3.64944 0.692085 1.553366
C  5.317351 -0.775119 0.439895
C  2.534595 -0.248454 1.167663
C  4.206897 -1.677603 0.034987
C  1.870003 -2.29708 -0.19114
C  -1.576186 -0.709292 -0.632087
C  -2.117525 0.557993 -1.24101
C  0.407863 -2.010551 -0.061989
C  -2.322413 -1.610765 0.134734
C  -0.20713 -0.950217 -0.714851
C  -0.371095 -2.891874 0.667679
C  -1.735226 -2.693491 0.770217
C  -4.359367 -0.0503 1.329165
H  -1.684894 3.835563 0.939171
H  0.474025 2.880341 1.23304
H  0.851373 2.98561 -0.484093
H  2.065332 4.913422 0.347343
H  0.799645 5.287287 1.519343
H  0.160553 6.755984 -0.301368
H  0.685272 5.582337 -1.514467
H  -2.745184 3.17769 -1.203679
H  -1.14828 2.898415 -1.920508
H  4.538684 1.054287 -0.373946
H  5.637358 1.280855 0.974354
H  3.233181 1.697383 1.639872
H  3.976254 0.403595 2.559644
H  5.721363 -1.148445 1.388677
H  6.122148 -0.852492 -0.293358
H  -3.204757 0.554197 -1.334306
H  -1.73007 0.673916 -2.260356
H  0.086403 -3.732947 1.171547
H  -2.327194 -3.385829 1.350859
H  -3.933186 0.841407 0.875918
H  -3.910095 -0.221546 2.305928
H  -5.437898 0.073896 1.43691
H  3.739642 -3.276399 -0.80966
elementType: Cl S O C H
totalener: -2161.10692675 hartree
nucrepener: 3379.03179284 hartree
electener: -5540.13871959 hartree
oneelecener: -9688.41115379 hartree
twoeener: 4148.27243420 hartree
cpcmener: -0.04895286 hartree
kineticenergy: 2154.05089542 hartree
xcener: -162.928998968857 hartree
chargesum: 0.0000000
charge: -0.072338 0.856421 -0.412070 -0.342298 -0.464671 -0.305941 -0.433880 -0.540731 -0.551421 0.191161 -0.176910 -0.131947 0.035739 -0.040764 -0.300292 -0.133319 -0.100323 -0.090079 0.304370 0.311873 0.381945 -0.017458 -0.075059 0.138629 0.000181 -0.062030 -0.146888 -0.103852 -0.245068 0.084746 0.076932 0.072873 0.077859 0.080154 0.082874 0.069724 0.095166 0.084914 0.084656 0.083259 0.091436 0.106100 0.111102 0.099124 0.115440 0.125419 0.147676 0.154977 0.134248 0.142267 0.139501 0.266573
qa: -0.0723 0.8564 -0.4121 -0.3423 -0.4647 -0.3059 -0.4339 -0.5407 -0.5514 0.1912 -0.1769 -0.1319 0.0357 -0.0408 -0.3003 -0.1333 -0.1003 -0.0901 0.3044 0.3119 0.3819 -0.0175 -0.0751 0.1386 0.0002 -0.0620 -0.1469 -0.1039 -0.2451 0.0847 0.0769 0.0729 0.0779 0.0802 0.0829 0.0697 0.0952 0.0849 0.0847 0.0833 0.0914 0.1061 0.1111 0.0991 0.1154 0.1254 0.1477 0.1550 0.1342 0.1423 0.1395 0.2666
va: 1.2711 5.5415 1.9616 1.9018 2.0108 2.2588 2.0775 1.9088 1.9302 3.8758 3.9165 3.9300 3.9666 3.9587 3.4832 3.9203 3.9050 3.9406 3.9160 3.8999 3.7780 3.7451 3.8884 3.5303 3.7555 4.0088 4.0634 3.9385 3.8657 1.0051 1.0328 1.0212 1.0161 1.0080 0.9923 0.9872 1.0026 1.0033 1.0102 1.0133 1.0181 1.0093 1.0069 1.0216 1.0269 1.0012 1.0071 1.0194 1.0151 1.0089 1.0129 1.0631
dispcorr: -0.031349107 hartree
energy: -2161.138275856586
dipole: 10.77889 -6.70819 4.07070 30.17382 -28.39358 1.78024 9.49376 -8.31717 1.17658
magnitude: 4.59611 au
magnitude: 11.68238 debye
