program: Orca
programVersion: 5.0.2
elementType: Cl S O O O O O O O C C C C C C C C C C C C C C C C C C C C H H H H H H H H H H H H H H H H H H H H H H H
charge: 0
multiplicity: 1
keywords: wb97x-d3
keywords: def2-TZVPP
keywords: def2/J RIJCOSX
keywords: DEFGRID2
keywords: scfconv7
keywords: smallprint printgap noloewdin
keywords: NOSOSCF
formula: C20H23ClO7S
InChI: InChI=1/C20H23ClO7S/c1-29(25,26)17-8-7-13(20(24)18-15(22)5-2-6-16(18)23)19(21)14(17)11-27-10-12-4-3-9-28-12/h7-8,12,22H,2-6,9-11H2,1H3
52 atoms
Cl 1.117163 0.839957 -0.06724
S  -3.916379 -1.339092 0.4858
O  -1.876374 5.347965 -0.009354
O  -1.853263 1.769584 -0.735621
O  1.777547 -1.655405 2.12597
O  4.590966 -2.155268 -1.594094
O  2.136284 -2.217504 -1.927059
O  -4.439526 -2.70102 0.41445
O  -4.199154 -0.56577 1.692763
C  -1.251096 4.07843 -0.167104
C  -0.125748 4.281161 -1.17968
C  -0.632679 5.462037 -2.000635
C  -1.349446 6.28236 -0.942413
C  -2.320929 3.098516 -0.64387
C  3.082961 -1.829861 0.182897
C  5.330263 -1.979533 1.96494
C  4.09715 -1.215929 2.419049
C  5.591409 -1.736437 0.489488
C  2.879338 -1.582608 1.613213
C  4.369564 -1.922066 -0.338275
C  1.97499 -1.954943 -0.730026
C  -1.318967 -0.298411 0.245436
C  -1.803119 1.10304 0.505233
C  0.553494 -1.764634 -0.299368
C  -2.142787 -1.430128 0.221185
C  0.028272 -0.505795 -0.039005
C  -0.293203 -2.858742 -0.301429
C  -1.640461 -2.695994 -0.037447
C  -4.517208 -0.461367 -0.934924
H  -0.858635 3.760625 0.805076
H  0.804135 4.540548 -0.669419
H  0.066031 3.388516 -1.77497
H  -1.327358 5.129906 -2.775254
H  0.165248 6.020834 -2.489041
H  -0.652039 6.963443 -0.4400
H  -2.167568 6.884028 -1.34463
H  -3.194947 3.158299 0.018977
H  -2.656739 3.376818 -1.647245
H  6.199255 -1.670043 2.545709
H  5.1931 -3.048694 2.145241
H  4.259943 -0.139468 2.28538
H  3.888144 -1.380336 3.47601
H  6.383735 -2.382299 0.106464
H  5.927634 -0.704322 0.329084
H  -1.116732 1.584247 1.210814
H  -2.780062 1.112833 0.991736
H  0.096004 -3.846665 -0.510204
H  -2.288077 -3.560924 -0.050851
H  -5.600518 -0.393549 -0.832258
H  -4.267402 -1.02245 -1.833607
H  -4.091176 0.537379 -0.989515
H  3.701342 -2.246124 -2.052176
elementType: Cl S O C H
totalener: -2161.10612621 hartree
nucrepener: 3311.70054705 hartree
electener: -5472.80667326 hartree
oneelecener: -9553.71704479 hartree
twoeener: 4080.91037153 hartree
cpcmener: -0.04926342 hartree
kineticenergy: 2154.05442805 hartree
xcener: -162.930585343370 hartree
chargesum: -0.0000000
charge: -0.069764 0.854532 -0.416434 -0.363570 -0.450516 -0.305369 -0.435110 -0.549626 -0.541206 0.185779 -0.167861 -0.155780 0.042661 -0.024944 -0.328943 -0.140965 -0.075567 -0.079647 0.313994 0.304681 0.367945 -0.007116 -0.104791 0.122519 -0.001154 -0.035052 -0.139148 -0.107510 -0.244830 0.082537 0.091475 0.068379 0.076940 0.082539 0.075785 0.080570 0.084628 0.109311 0.084715 0.085872 0.096758 0.082933 0.100762 0.111283 0.123974 0.129921 0.148549 0.156718 0.139168 0.142791 0.131934 0.265249
qa: -0.0698 0.8545 -0.4164 -0.3636 -0.4505 -0.3054 -0.4351 -0.5496 -0.5412 0.1858 -0.1679 -0.1558 0.0427 -0.0249 -0.3289 -0.1410 -0.0756 -0.0796 0.3140 0.3047 0.3679 -0.0071 -0.1048 0.1225 -0.0012 -0.0351 -0.1391 -0.1075 -0.2448 0.0825 0.0915 0.0684 0.0769 0.0825 0.0758 0.0806 0.0846 0.1093 0.0847 0.0859 0.0968 0.0829 0.1008 0.1113 0.1240 0.1299 0.1485 0.1567 0.1392 0.1428 0.1319 0.2652
va: 1.2776 5.5310 1.9696 1.8923 2.0391 2.2594 2.0780 1.9313 1.9079 3.8975 3.8914 3.9615 3.9368 3.9169 3.4463 3.9322 3.8548 3.9405 3.9579 3.9177 3.8008 3.6995 3.9188 3.5579 3.7473 4.0129 4.0506 3.9374 3.8629 1.0062 1.0065 1.0342 1.0082 1.0159 0.9908 0.9937 1.0107 0.9953 1.0118 1.0073 1.0091 1.0304 1.0202 1.0066 0.9970 1.0283 1.0046 1.0178 1.0144 1.0090 1.0150 1.0652
dispcorr: -0.030043566 hartree
energy: -2161.136169777288
dipole: 4.61229 -0.94797 3.66432 23.18676 -22.20050 0.98627 -3.63713 2.13341 -1.50372
magnitude: 4.08180 au
magnitude: 10.37512 debye
