program: Orca
programVersion: 5.0.2
elementType: Cl S O O O O O O O C C C C C C C C C C C C C C C C C C C C H H H H H H H H H H H H H H H H H H H H H H H
charge: 0
multiplicity: 1
keywords: wb97x-d3
keywords: def2-TZVPP
keywords: def2/J RIJCOSX
keywords: DEFGRID2
keywords: scfconv7
keywords: smallprint printgap noloewdin
keywords: NOSOSCF
formula: C20H23ClO7S
InChI: InChI=1/C20H23ClO7S/c1-29(25,26)17-8-7-13(20(24)18-15(22)5-2-6-16(18)23)19(21)14(17)11-27-10-12-4-3-9-28-12/h7-8,12,22H,2-6,9-11H2,1H3
52 atoms
Cl 0.597416 -0.357571 2.074563
S  -4.04076 -1.335066 -0.746205
O  -1.124913 4.331713 -0.620267
O  -1.637026 1.489415 1.541365
O  1.524943 0.429746 -1.227901
O  4.544177 -2.649745 0.622238
O  2.140504 -3.260348 0.485628
O  -4.37496 -2.375439 -1.714591
O  -4.701072 -1.372532 0.556566
C  -1.02637 3.560241 0.572503
C  0.469081 3.406343 0.874701
C  1.102944 4.510252 0.034868
C  0.17058 4.541185 -1.159993
C  -1.748619 2.242105 0.355714
C  2.919588 -1.152843 -0.190974
C  5.076469 0.585775 -0.962559
C  3.711105 1.196522 -0.693537
C  5.362424 -0.532611 0.022313
C  2.615421 0.167061 -0.751058
C  4.22726 -1.485675 0.146797
C  1.886718 -2.127244 0.065066
C  -1.629179 -0.735883 0.56842
C  -2.296265 0.252764 1.510178
C  0.44066 -1.81174 -0.154184
C  -2.265834 -1.394833 -0.491895
C  -0.269755 -1.002738 0.722645
C  -0.221811 -2.424357 -1.201906
C  -1.578577 -2.225856 -1.364962
C  -4.353267 0.226859 -1.52811
H  -1.527158 4.11216 1.37708
H  0.686314 3.495119 1.938345
H  0.831161 2.430253 0.54647
H  2.135553 4.298262 -0.243232
H  1.084899 5.466912 0.56185
H  0.173803 5.491759 -1.69705
H  0.432309 3.750201 -1.875219
H  -2.804292 2.432196 0.116809
H  -1.303744 1.716305 -0.50137
H  5.114488 0.197876 -1.983065
H  5.850893 1.348354 -0.884751
H  3.48438 1.998303 -1.396723
H  3.691738 1.631219 0.313223
H  5.536974 -0.120909 1.024007
H  6.265055 -1.085355 -0.244584
H  -2.270534 -0.149791 2.525644
H  -3.349032 0.39269 1.263947
H  0.317119 -3.062635 -1.889525
H  -2.089821 -2.725079 -2.175197
H  -5.414158 0.252112 -1.7801
H  -3.757952 0.299927 -2.436266
H  -4.118703 1.047882 -0.85696
H  3.704026 -3.196218 0.689055
elementType: Cl S O C H
totalener: -2161.10468907 hartree
nucrepener: 3428.22905580 hartree
electener: -5589.33374488 hartree
oneelecener: -9786.41155116 hartree
twoeener: 4197.07780629 hartree
cpcmener: -0.04920089 hartree
kineticenergy: 2154.06362628 hartree
xcener: -162.933220398093 hartree
chargesum: -0.0000000
charge: -0.064310 0.857091 -0.414375 -0.345869 -0.458343 -0.304487 -0.433659 -0.551485 -0.542472 0.191250 -0.122143 -0.144796 0.033317 -0.058259 -0.312829 -0.136481 -0.080978 -0.076875 0.310608 0.301101 0.364685 -0.113542 -0.050806 0.138559 0.054588 -0.030511 -0.136529 -0.119079 -0.260763 0.090582 0.085817 0.024260 0.076368 0.083056 0.088403 0.065804 0.102385 0.089387 0.086371 0.084816 0.086999 0.097605 0.111414 0.101056 0.139516 0.104535 0.148777 0.150986 0.147822 0.142039 0.133492 0.265897
qa: -0.0643 0.8571 -0.4144 -0.3459 -0.4583 -0.3045 -0.4337 -0.5515 -0.5425 0.1913 -0.1221 -0.1448 0.0333 -0.0583 -0.3128 -0.1365 -0.0810 -0.0769 0.3106 0.3011 0.3647 -0.1135 -0.0508 0.1386 0.0546 -0.0305 -0.1365 -0.1191 -0.2608 0.0906 0.0858 0.0243 0.0764 0.0831 0.0884 0.0658 0.1024 0.0894 0.0864 0.0848 0.0870 0.0976 0.1114 0.1011 0.1395 0.1045 0.1488 0.1510 0.1478 0.1420 0.1335 0.2659
va: 1.2790 5.5393 1.9503 1.9318 2.0116 2.2612 2.0775 1.9280 1.9072 3.9074 3.9329 3.9222 3.9642 3.9804 3.4677 3.9537 3.8584 3.9399 3.9122 3.9238 3.8109 3.6987 3.9023 3.5441 3.6310 4.0054 4.0346 3.9763 3.8651 1.0048 1.0202 1.0328 1.0140 1.0113 0.9952 0.9971 1.0021 0.9894 1.0071 1.0109 1.0235 1.0062 1.0070 1.0202 0.9964 1.0319 1.0034 1.0199 1.0138 1.0071 1.0097 1.0634
dispcorr: -0.033755999 hartree
energy: -2161.138445072308
dipole: 11.26098 -7.29840 3.96258 29.09783 -27.11051 1.98732 -9.57047 8.66699 -0.90348
magnitude: 4.52413 au
magnitude: 11.49943 debye
