program: Orca
programVersion: 5.0.2
elementType: Cl S O O O O O O O C C C C C C C C C C C C C C C C C C C C H H H H H H H H H H H H H H H H H H H H H H H
charge: 0
multiplicity: 1
keywords: wb97x-d3
keywords: def2-TZVPP
keywords: def2/J RIJCOSX
keywords: DEFGRID2
keywords: scfconv7
keywords: smallprint printgap noloewdin
keywords: NOSOSCF
formula: C20H23ClO7S
InChI: InChI=1/C20H23ClO7S/c1-29(25,26)17-8-7-13(20(24)18-15(22)5-2-6-16(18)23)19(21)14(17)11-27-10-12-4-3-9-28-12/h7-8,12,22H,2-6,9-11H2,1H3
52 atoms
Cl 0.718205 -0.266734 2.158485
S  -3.955635 -1.065135 -0.682242
O  -1.612476 4.506685 -0.61458
O  -1.545154 1.633341 1.55843
O  1.717482 0.402613 -1.041358
O  4.540707 -2.875114 0.767545
O  2.103059 -3.330062 0.620852
O  -4.304157 0.352797 -0.666112
O  -4.272461 -1.83021 -1.885618
C  -1.133817 3.694335 0.452092
C  0.37452 3.575037 0.243455
C  0.508045 3.725141 -1.267711
C  -0.581865 4.739666 -1.568274
C  -1.871357 2.364616 0.395637
C  3.015957 -1.271282 -0.034979
C  5.282787 0.315729 -0.818062
C  3.962216 1.019624 -0.555217
C  5.493136 -0.810981 0.176777
C  2.797664 0.067418 -0.588286
C  4.299341 -1.68983 0.300017
C  1.9219 -2.180186 0.206778
C  -1.532804 -0.624999 0.688025
C  -2.155241 0.374355 1.645445
C  0.495079 -1.787898 -0.022118
C  -2.199163 -1.268843 -0.363183
C  -0.181012 -0.931993 0.836684
C  -0.199334 -2.396059 -1.052227
C  -1.546773 -2.141607 -1.221514
C  -4.743679 -1.875258 0.686024
H  -1.369433 4.18492 1.403678
H  0.891499 4.391187 0.753296
H  0.782995 2.640109 0.626337
H  0.312725 2.778694 -1.774445
H  1.493586 4.070165 -1.579535
H  -0.199546 5.764048 -1.467391
H  -0.997023 4.639026 -2.575372
H  -2.951304 2.551897 0.349425
H  -1.59216 1.816951 -0.515553
H  5.295828 -0.082187 -1.835102
H  6.106679 1.024955 -0.746087
H  3.78561 1.823822 -1.270276
H  3.976704 1.473444 0.443389
H  5.687332 -0.402607 1.176359
H  6.361244 -1.420858 -0.080324
H  -2.009866 0.018977 2.667991
H  -3.232664 0.461658 1.499742
H  0.308312 -3.072325 -1.727148
H  -2.077066 -2.632173 -2.024563
H  -5.820154 -1.798365 0.527381
H  -4.479957 -1.396158 1.626298
H  -4.447572 -2.922346 0.704259
H  3.667625 -3.367374 0.829443
elementType: Cl S O C H
totalener: -2161.10600376 hartree
nucrepener: 3417.47025057 hartree
electener: -5578.57625433 hartree
oneelecener: -9766.00955568 hartree
twoeener: 4187.43330135 hartree
cpcmener: -0.05018981 hartree
kineticenergy: 2154.03805207 hartree
xcener: -162.928727858196 hartree
chargesum: -0.0000000
charge: -0.066156 0.855247 -0.416527 -0.356301 -0.462258 -0.304262 -0.435239 -0.536056 -0.552600 0.213886 -0.142971 -0.178478 0.045259 -0.052158 -0.318517 -0.136574 -0.082343 -0.076589 0.319690 0.301337 0.369345 -0.063075 -0.023716 0.136046 0.035564 -0.077959 -0.145271 -0.106314 -0.254771 0.077295 0.093520 0.054659 0.074086 0.084916 0.075964 0.079692 0.088036 0.089876 0.085827 0.084320 0.088774 0.098305 0.110899 0.100726 0.138057 0.092813 0.148712 0.155842 0.139591 0.141347 0.142592 0.265908
qa: -0.0662 0.8552 -0.4165 -0.3563 -0.4623 -0.3043 -0.4352 -0.5361 -0.5526 0.2139 -0.1430 -0.1785 0.0453 -0.0522 -0.3185 -0.1366 -0.0823 -0.0766 0.3197 0.3013 0.3693 -0.0631 -0.0237 0.1360 0.0356 -0.0780 -0.1453 -0.1063 -0.2548 0.0773 0.0935 0.0547 0.0741 0.0849 0.0760 0.0797 0.0880 0.0899 0.0858 0.0843 0.0888 0.0983 0.1109 0.1007 0.1381 0.0928 0.1487 0.1558 0.1396 0.1413 0.1426 0.2659
va: 1.2777 5.5430 1.9664 1.9390 2.0114 2.2611 2.0763 1.9048 1.9303 3.9001 3.8859 3.9448 3.9594 3.9653 3.4897 3.9462 3.8672 3.9395 3.9066 3.9290 3.8034 3.6646 3.9028 3.5738 3.6333 4.0297 4.0551 3.9492 3.8727 1.0064 1.0101 1.0377 1.0181 1.0139 0.9904 0.9928 1.0146 0.9890 1.0072 1.0111 1.0238 1.0079 1.0068 1.0201 0.9935 1.0357 1.0043 1.0194 1.0138 1.0032 1.0070 1.0630
dispcorr: -0.032934041 hartree
energy: -2161.138937799316
dipole: 8.07826 -4.65301 3.42525 19.93786 -21.12005 -1.18219 -6.11769 7.42555 1.30786
magnitude: 3.85232 au
magnitude: 9.79183 debye
