program: Orca
programVersion: 5.0.2
elementType: Cl S O O O O O O O C C C C C C C C C C C C C C C C C C C C H H H H H H H H H H H H H H H H H H H H H H H
charge: 0
multiplicity: 1
keywords: wb97x-d3
keywords: def2-TZVPP
keywords: def2/J RIJCOSX
keywords: DEFGRID2
keywords: scfconv7
keywords: smallprint printgap noloewdin
keywords: NOSOSCF
formula: C20H23ClO7S
InChI: InChI=1/C20H23ClO7S/c1-29(25,26)17-8-7-13(20(24)18-15(22)5-2-6-16(18)23)19(21)14(17)11-27-10-12-4-3-9-28-12/h7-8,12,22H,2-6,9-11H2,1H3
52 atoms
Cl 0.792751 0.198276 -1.554461
S  -4.12441 -1.501917 0.239899
O  -0.838463 5.131095 -0.491396
O  -1.715249 1.636889 -0.309249
O  1.364971 -0.208828 1.764964
O  4.563532 -2.61808 -0.664184
O  2.166728 -3.26924 -0.83633
O  -4.68502 -1.219935 -1.079235
O  -4.580317 -2.704113 0.931645
C  -1.031363 3.868265 0.133218
C  0.3241 3.489598 0.723804
C  1.292652 4.141075 -0.256075
C  0.551386 5.420354 -0.613723
C  -1.540111 2.892915 -0.921077
C  2.852706 -1.389488 0.387527
C  4.748532 0.693425 0.782812
C  3.582236 0.631667 1.750654
C  5.275685 -0.70384 0.50698
C  2.492829 -0.317052 1.316068
C  4.185072 -1.610011 0.059002
C  1.858699 -2.262021 -0.192003
C  -1.585865 -0.669141 -0.604703
C  -2.125896 0.613559 -1.18463
C  0.394674 -1.986308 -0.058559
C  -2.34009 -1.610451 0.102498
C  -0.212933 -0.896503 -0.666809
C  -0.391529 -2.902095 0.619319
C  -1.757725 -2.714077 0.706924
C  -4.411688 -0.119319 1.318703
H  -1.793084 3.975291 0.913214
H  0.433277 3.932391 1.717198
H  0.461234 2.414295 0.82957
H  1.440048 3.510375 -1.135026
H  2.27321 4.339249 0.176199
H  0.819305 6.229922 0.074124
H  0.759901 5.765998 -1.628605
H  -2.484881 3.265442 -1.340568
H  -0.823892 2.821604 -1.751417
H  4.433494 1.157468 -0.154664
H  5.545254 1.314019 1.191711
H  3.135029 1.615488 1.905385
H  3.929505 0.291318 2.733421
H  5.716746 -1.133647 1.414389
H  6.063042 -0.699218 -0.249276
H  -3.210341 0.603568 -1.300801
H  -1.720727 0.755801 -2.193344
H  0.062824 -3.761392 1.094506
H  -2.356707 -3.431859 1.248153
H  -4.008464 0.798528 0.897779
H  -3.950644 -0.320223 2.284014
H  -5.491738 -0.024149 1.43848
H  3.748803 -3.158688 -0.889622
elementType: Cl S O C H
totalener: -2161.10589165 hartree
nucrepener: 3400.06859788 hartree
electener: -5561.17448953 hartree
oneelecener: -9730.19250008 hartree
twoeener: 4169.01801055 hartree
cpcmener: -0.04838644 hartree
kineticenergy: 2154.05761313 hartree
xcener: -162.931765355538 hartree
chargesum: 0.0000000
charge: -0.073414 0.858337 -0.421551 -0.348545 -0.463578 -0.305372 -0.434070 -0.541004 -0.551217 0.229966 -0.148156 -0.156612 0.039314 -0.075123 -0.299853 -0.133781 -0.102163 -0.088761 0.305358 0.310335 0.372389 0.003726 -0.076722 0.151817 -0.005759 -0.077360 -0.149761 -0.100481 -0.251278 0.084721 0.093949 0.045612 0.072084 0.083661 0.078232 0.079799 0.096674 0.084163 0.084160 0.083619 0.092199 0.108357 0.111371 0.099274 0.117072 0.128496 0.147679 0.155285 0.137766 0.142894 0.139746 0.266500
qa: -0.0734 0.8583 -0.4216 -0.3485 -0.4636 -0.3054 -0.4341 -0.5410 -0.5512 0.2300 -0.1482 -0.1566 0.0393 -0.0751 -0.2999 -0.1338 -0.1022 -0.0888 0.3054 0.3103 0.3724 0.0037 -0.0767 0.1518 -0.0058 -0.0774 -0.1498 -0.1005 -0.2513 0.0847 0.0939 0.0456 0.0721 0.0837 0.0782 0.0798 0.0967 0.0842 0.0842 0.0836 0.0922 0.1084 0.1114 0.0993 0.1171 0.1285 0.1477 0.1553 0.1378 0.1429 0.1397 0.2665
va: 1.2742 5.5370 1.9635 1.8948 2.0112 2.2602 2.0760 1.9089 1.9305 3.9053 3.8976 3.9361 3.9552 3.9734 3.4638 3.9196 3.8991 3.9401 3.9211 3.9026 3.7921 3.7097 3.8716 3.5108 3.7685 4.0148 4.0623 3.9321 3.8662 1.0002 1.0097 1.0499 1.0081 1.0164 0.9911 0.9925 1.0061 0.9964 1.0106 1.0136 1.0187 1.0094 1.0068 1.0217 1.0294 0.9988 1.0065 1.0189 1.0158 1.0077 1.0129 1.0617
dispcorr: -0.032216211 hartree
energy: -2161.138107859863
dipole: 11.38737 -7.32292 4.06445 28.47551 -26.83745 1.63806 9.08077 -7.89606 1.18471
magnitude: 4.53944 au
magnitude: 11.53833 debye
