program: Orca
programVersion: 5.0.2
elementType: Cl S O O O O O O O C C C C C C C C C C C C C C C C C C C C H H H H H H H H H H H H H H H H H H H H H H H
charge: 0
multiplicity: 1
keywords: wb97x-d3
keywords: def2-TZVPP
keywords: def2/J RIJCOSX
keywords: DEFGRID2
keywords: scfconv7
keywords: smallprint printgap noloewdin
keywords: NOSOSCF
formula: C20H23ClO7S
InChI: InChI=1/C20H23ClO7S/c1-29(25,26)17-8-7-13(20(24)18-15(22)5-2-6-16(18)23)19(21)14(17)11-27-10-12-4-3-9-28-12/h7-8,12,22H,2-6,9-11H2,1H3
52 atoms
Cl 1.256545 0.367665 -1.501022
S  -3.830458 -0.953845 0.305798
O  -1.469621 4.102251 -1.672413
O  -2.102279 1.761107 0.091472
O  1.655697 -0.494111 1.843881
O  4.702255 -2.840487 -0.839829
O  2.263796 -3.187986 -1.189849
O  -4.378765 -0.029549 -0.681584
O  -4.445815 -2.277563 0.396472
C  -2.096902 4.169045 -0.395024
C  -0.975623 4.43428 0.626769
C  0.30326 4.1579 -0.158733
C  -0.123085 4.528024 -1.567204
C  -2.894435 2.905274 -0.141703
C  3.081215 -1.624863 0.357992
C  5.167601 0.127576 1.182346
C  3.958659 0.014208 2.091538
C  5.557246 -1.243286 0.659945
C  2.79005 -0.682248 1.440965
C  4.397589 -1.93147 0.033491
C  2.031929 -2.279212 -0.38734
C  -1.225487 -0.299604 -0.59516
C  -1.700385 1.053668 -1.057944
C  0.598794 -1.881659 -0.228292
C  -2.072519 -1.226328 0.031878
C  0.109939 -0.675441 -0.717388
C  -0.274436 -2.778752 0.355126
C  -1.611213 -2.451577 0.487056
C  -3.907625 -0.222106 1.920996
H  -2.81952 4.996757 -0.387242
H  -1.003451 5.476795 0.949354
H  -1.06776 3.817709 1.521545
H  0.582832 3.103516 -0.102769
H  1.15298 4.746756 0.187229
H  -0.043876 5.612439 -1.723022
H  0.460858 4.036109 -2.347779
H  -3.493137 3.059831 0.760258
H  -3.597747 2.7358 -0.966741
H  4.944317 0.790423 0.342868
H  6.005236 0.569256 1.721635
H  3.623343 0.991541 2.4418
H  4.21987 -0.564627 2.985697
H  5.916129 -1.876587 1.480301
H  6.369674 -1.187901 -0.067001
H  -2.520953 0.943369 -1.771172
H  -0.900207 1.566466 -1.587601
H  0.086527 -3.729097 0.725115
H  -2.279295 -3.163253 0.950728
H  -3.357244 0.713639 1.936759
H  -3.491391 -0.917771 2.647755
H  -4.960616 -0.044265 2.144218
H  3.847742 -3.242789 -1.178387
elementType: Cl S O C H
totalener: -2161.10526670 hartree
nucrepener: 3397.29327023 hartree
electener: -5558.39853694 hartree
oneelecener: -9725.79783760 hartree
twoeener: 4167.39930066 hartree
cpcmener: -0.04714538 hartree
kineticenergy: 2154.05796594 hartree
xcener: -162.932036956294 hartree
chargesum: -0.0000000
charge: -0.075570 0.879409 -0.414706 -0.374327 -0.461580 -0.305249 -0.433167 -0.542693 -0.560773 0.152915 -0.170272 -0.151604 0.031234 0.022360 -0.315801 -0.132690 -0.099409 -0.090305 0.316968 0.311491 0.362788 0.011978 -0.045802 0.143917 -0.057474 -0.008281 -0.143818 -0.114155 -0.264165 0.076210 0.092904 0.078930 0.063077 0.084398 0.087134 0.087647 0.095983 0.092150 0.083688 0.082935 0.088452 0.103830 0.111960 0.100272 0.132817 0.086129 0.148191 0.145651 0.138952 0.142678 0.138638 0.266158
qa: -0.0756 0.8794 -0.4147 -0.3743 -0.4616 -0.3052 -0.4332 -0.5427 -0.5608 0.1529 -0.1703 -0.1516 0.0312 0.0224 -0.3158 -0.1327 -0.0994 -0.0903 0.3170 0.3115 0.3628 0.0120 -0.0458 0.1439 -0.0575 -0.0083 -0.1438 -0.1142 -0.2642 0.0762 0.0929 0.0789 0.0631 0.0844 0.0871 0.0876 0.0960 0.0921 0.0837 0.0829 0.0885 0.1038 0.1120 0.1003 0.1328 0.0861 0.1482 0.1457 0.1390 0.1427 0.1386 0.2662
va: 1.2661 5.5087 1.9376 1.8881 2.0248 2.2599 2.0764 1.9160 1.9148 3.9031 3.9113 3.9323 3.9118 3.8400 3.4704 3.9198 3.8959 3.9411 3.9217 3.8949 3.8020 3.7398 3.9287 3.5535 3.7717 3.9425 4.0568 3.9706 3.8623 1.0062 1.0110 1.0235 1.0254 1.0204 0.9979 0.9973 0.9972 1.0175 1.0107 1.0136 1.0280 1.0075 1.0069 1.0215 1.0059 1.0176 1.0050 1.0213 1.0145 1.0079 1.0114 1.0624
dispcorr: -0.032174851 hartree
energy: -2161.137441555465
dipole: 5.44985 -1.55738 3.89247 25.57841 -24.22182 1.35660 12.81324 -10.48037 2.33287
magnitude: 4.73645 au
magnitude: 12.03910 debye
