program: Orca
programVersion: 5.0.2
elementType: Cl S O O O O O O O C C C C C C C C C C C C C C C C C C C C H H H H H H H H H H H H H H H H H H H H H H H
charge: 0
multiplicity: 1
keywords: wb97x-d3
keywords: def2-TZVPP
keywords: def2/J RIJCOSX
keywords: DEFGRID2
keywords: scfconv7
keywords: smallprint printgap noloewdin
keywords: NOSOSCF
formula: C20H23ClO7S
InChI: InChI=1/C20H23ClO7S/c1-29(25,26)17-8-7-13(20(24)18-15(22)5-2-6-16(18)23)19(21)14(17)11-27-10-12-4-3-9-28-12/h7-8,12,22H,2-6,9-11H2,1H3
52 atoms
Cl 0.668397 -0.476495 2.072295
S  -4.016144 -1.246516 -0.732495
O  -1.392606 4.534855 -0.250351
O  -1.503234 1.446837 1.589701
O  1.557282 0.353995 -1.20759
O  4.556758 -2.787577 0.55113
O  2.149431 -3.398966 0.325966
O  -4.399738 -2.25028 -1.720344
O  -4.673413 -1.280515 0.571838
C  -0.982426 3.594051 0.734322
C  0.533421 3.461892 0.590257
C  0.759414 3.831278 -0.871743
C  -0.297405 4.901121 -1.078871
C  -1.737422 2.295767 0.489547
C  2.933789 -1.247443 -0.183405
C  4.851698 0.804792 0.257495
C  3.771649 1.080976 -0.770815
C  5.35742 -0.619186 0.112282
C  2.648775 0.075402 -0.740339
C  4.235099 -1.59289 0.161911
C  1.896265 -2.235116 0.003637
C  -1.575939 -0.757523 0.574545
C  -2.198849 0.22993 1.547142
C  0.452215 -1.890353 -0.179602
C  -2.243903 -1.384084 -0.486782
C  -0.224716 -1.070183 0.713515
C  -0.241843 -2.477168 -1.222066
C  -1.592933 -2.232176 -1.371301
C  -4.258727 0.346765 -1.476988
H  -1.259585 3.97149 1.725447
H  1.038691 4.174437 1.245861
H  0.893817 2.46636 0.849198
H  0.583813 2.974505 -1.524348
H  1.765819 4.199502 -1.070696
H  0.084166 5.887125 -0.786433
H  -0.64291 4.972904 -2.112817
H  -2.809825 2.518142 0.397819
H  -1.412126 1.835133 -0.454895
H  5.67773 1.504916 0.135284
H  4.455537 0.951855 1.265257
H  4.199839 1.051192 -1.77992
H  3.342516 2.076935 -0.646712
H  6.0834 -0.876405 0.885448
H  5.867406 -0.747306 -0.850194
H  -2.164486 -0.197312 2.552389
H  -3.252311 0.403509 1.326738
H  0.269226 -3.127464 -1.919661
H  -2.128879 -2.707179 -2.180227
H  -3.978321 1.138565 -0.788269
H  -5.319741 0.432472 -1.715288
H  -3.668615 0.413709 -2.389186
H  3.729687 -3.353888 0.529408
elementType: Cl S O C H
totalener: -2161.10478348 hartree
nucrepener: 3430.80837523 hartree
electener: -5591.91315871 hartree
oneelecener: -9791.60716951 hartree
twoeener: 4199.69401081 hartree
cpcmener: -0.04878172 hartree
kineticenergy: 2154.05847327 hartree
xcener: -162.933043257430 hartree
chargesum: -0.0000000
charge: -0.064718 0.857384 -0.414545 -0.349400 -0.471022 -0.303446 -0.433167 -0.550395 -0.542076 0.202524 -0.145218 -0.184403 0.044316 -0.059097 -0.291098 -0.133497 -0.099327 -0.085066 0.307682 0.306227 0.361789 -0.077524 -0.051192 0.136435 0.044986 -0.052574 -0.133870 -0.118469 -0.265949 0.077209 0.095754 0.059711 0.073920 0.086502 0.076044 0.080345 0.095363 0.100429 0.083183 0.083941 0.108580 0.094070 0.099689 0.110657 0.139693 0.105103 0.148798 0.151603 0.136846 0.148106 0.142758 0.266406
qa: -0.0647 0.8574 -0.4145 -0.3494 -0.4710 -0.3034 -0.4332 -0.5504 -0.5421 0.2025 -0.1452 -0.1844 0.0443 -0.0591 -0.2911 -0.1335 -0.0993 -0.0851 0.3077 0.3062 0.3618 -0.0775 -0.0512 0.1364 0.0450 -0.0526 -0.1339 -0.1185 -0.2659 0.0772 0.0958 0.0597 0.0739 0.0865 0.0760 0.0803 0.0954 0.1004 0.0832 0.0839 0.1086 0.0941 0.0997 0.1107 0.1397 0.1051 0.1488 0.1516 0.1368 0.1481 0.1428 0.2664
va: 1.2789 5.5387 1.9673 1.9314 2.0012 2.2621 2.0760 1.9297 1.9070 3.9072 3.8777 3.9322 3.9725 3.9694 3.4994 3.9313 3.9090 3.9399 3.8942 3.9016 3.8035 3.6800 3.8970 3.5562 3.6460 4.0011 4.0361 3.9720 3.8644 1.0082 1.0103 1.0349 1.0252 1.0133 0.9913 0.9928 1.0041 0.9814 1.0127 1.0105 1.0095 1.0135 1.0217 1.0073 0.9964 1.0334 1.0044 1.0197 1.0078 1.0141 1.0069 1.0608
dispcorr: -0.033746244 hartree
energy: -2161.138529722171
dipole: 10.17211 -6.16707 4.00504 29.62189 -27.72662 1.89527 -9.70744 8.56406 -1.14338
magnitude: 4.57599 au
magnitude: 11.63125 debye
