program: Orca
programVersion: 5.0.2
elementType: Cl S O O O O O O O C C C C C C C C C C C C C C C C C C C C H H H H H H H H H H H H H H H H H H H H H H H
charge: 0
multiplicity: 1
keywords: wb97x-d3
keywords: def2-TZVPP
keywords: def2/J RIJCOSX
keywords: DEFGRID2
keywords: scfconv7
keywords: smallprint printgap noloewdin
keywords: NOSOSCF
formula: C20H23ClO7S
InChI: InChI=1/C20H23ClO7S/c1-29(25,26)17-8-7-13(20(24)18-15(22)5-2-6-16(18)23)19(21)14(17)11-27-10-12-4-3-9-28-12/h7-8,12,22H,2-6,9-11H2,1H3
52 atoms
Cl 1.604462 -0.380825 -1.881165
S  -3.412043 -0.224968 0.506467
O  -2.519755 4.023847 0.839062
O  -1.275396 1.976827 -0.659869
O  2.241715 -0.436027 1.473694
O  4.489158 -3.962386 -0.649699
O  2.000363 -3.906714 -0.708392
O  -3.906037 0.546234 -0.629093
O  -4.247153 -1.331262 0.970605
C  -1.772806 4.294031 -0.336489
C  -2.417982 5.534436 -0.987733
C  -3.612282 5.851978 -0.080093
C  -3.825553 4.538761 0.655516
C  -1.794557 3.120965 -1.295388
C  3.254279 -2.184642 0.275536
C  5.71635 -1.217837 1.402803
C  4.58923 -0.226288 1.165306
C  5.780925 -2.228842 0.272339
C  3.261169 -0.917185 1.014227
C  4.450242 -2.819699 -0.035383
C  2.025914 -2.791755 -0.178338
C  -0.857446 -0.34495 -0.719949
C  -1.170725 0.882061 -1.535804
C  0.708718 -2.093945 -0.042589
C  -1.779258 -0.907778 0.176505
C  0.382479 -0.974955 -0.802247
C  -0.242771 -2.641152 0.795893
C  -1.484521 -2.045168 0.911998
C  -3.128822 0.851477 1.886317
H  -0.741312 4.483467 -0.025851
H  -1.718035 6.366305 -1.052358
H  -2.746388 5.313664 -2.00585
H  -4.49511 6.169346 -0.63447
H  -3.361764 6.643599 0.628171
H  -4.292224 4.65321 1.635083
H  -4.447268 3.850059 0.06841
H  -2.815896 2.935075 -1.653741
H  -1.193517 3.385092 -2.175532
H  6.668437 -0.693435 1.479609
H  5.56147 -1.734253 2.352773
H  4.772712 0.327394 0.236447
H  4.520827 0.506468 1.969253
H  6.48984 -3.030624 0.485659
H  6.128366 -1.742913 -0.647849
H  -2.093382 0.721938 -2.099005
H  -0.390155 1.06063 -2.278712
H  -0.014345 -3.525161 1.376795
H  -2.212676 -2.479328 1.583089
H  -2.430413 1.634453 1.611025
H  -2.738007 0.268291 2.718177
H  -4.090705 1.287232 2.161753
H  3.545205 -4.251376 -0.824454
elementType: Cl S O C H
totalener: -2161.10724265 hartree
nucrepener: 3329.41473182 hartree
electener: -5490.52197447 hartree
oneelecener: -9590.53446300 hartree
twoeener: 4100.01248853 hartree
cpcmener: -0.04704111 hartree
kineticenergy: 2154.06911248 hartree
xcener: -162.932422022904 hartree
chargesum: -0.0000000
charge: -0.068902 0.880153 -0.400727 -0.354462 -0.447356 -0.305347 -0.435870 -0.544025 -0.560980 0.223202 -0.195942 -0.127531 0.010431 -0.071530 -0.340302 -0.139391 -0.070173 -0.079720 0.304846 0.306539 0.370593 -0.032049 -0.044170 0.129908 -0.020875 0.015209 -0.135894 -0.131912 -0.281888 0.093721 0.082016 0.086517 0.075926 0.077515 0.097653 0.073393 0.091643 0.095091 0.084702 0.085332 0.095784 0.082647 0.099447 0.110990 0.126955 0.103442 0.148740 0.146560 0.131822 0.153095 0.139747 0.265427
qa: -0.0689 0.8802 -0.4007 -0.3545 -0.4474 -0.3053 -0.4359 -0.5440 -0.5610 0.2232 -0.1959 -0.1275 0.0104 -0.0715 -0.3403 -0.1394 -0.0702 -0.0797 0.3048 0.3065 0.3706 -0.0320 -0.0442 0.1299 -0.0209 0.0152 -0.1359 -0.1319 -0.2819 0.0937 0.0820 0.0865 0.0759 0.0775 0.0977 0.0734 0.0916 0.0951 0.0847 0.0853 0.0958 0.0826 0.0994 0.1110 0.1270 0.1034 0.1487 0.1466 0.1318 0.1531 0.1397 0.2654
va: 1.2760 5.5081 1.9455 1.9384 2.0392 2.2597 2.0743 1.9099 1.9155 3.8624 3.9455 3.9317 3.9507 3.9482 3.4333 3.9325 3.8448 3.9402 3.9650 3.9210 3.8022 3.7979 3.9210 3.5544 3.7280 3.9283 4.0565 3.9948 3.8466 1.0057 1.0131 1.0068 1.0175 1.0109 0.9943 0.9944 0.9942 1.0014 1.0115 1.0074 1.0102 1.0312 1.0202 1.0065 0.9994 1.0164 1.0049 1.0209 1.0432 1.0071 1.0096 1.0626
dispcorr: -0.030689216 hartree
energy: -2161.137931870472
dipole: -3.65407 7.15413 3.50006 30.33736 -29.02346 1.31389 7.34431 -7.20342 0.14089
magnitude: 3.74120 au
magnitude: 9.50938 debye
