program: Orca
programVersion: 5.0.2
elementType: Cl S O O O O O O O C C C C C C C C C C C C C C C C C C C C H H H H H H H H H H H H H H H H H H H H H H H
charge: 0
multiplicity: 1
keywords: wb97x-d3
keywords: def2-TZVPP
keywords: def2/J RIJCOSX
keywords: DEFGRID2
keywords: scfconv7
keywords: smallprint printgap noloewdin
keywords: NOSOSCF
formula: C20H23ClO7S
InChI: InChI=1/C20H23ClO7S/c1-29(25,26)17-8-7-13(20(24)18-15(22)5-2-6-16(18)23)19(21)14(17)11-27-10-12-4-3-9-28-12/h7-8,12,22H,2-6,9-11H2,1H3
52 atoms
Cl 0.770414 -0.817541 2.176467
S  -3.96224 -0.845315 -0.709755
O  -1.816565 3.180807 -0.695921
O  -2.248227 1.441707 1.480837
O  1.817872 0.770677 -0.635281
O  4.553088 -2.966648 0.049512
O  2.11778 -3.303085 -0.366728
O  -4.28813 -1.387093 -2.027156
O  -4.592396 -1.46666 0.452452
C  -1.277093 3.436875 0.595217
C  0.043327 4.198131 0.377741
C  0.028087 4.526507 -1.11436
C  -0.808053 3.388462 -1.668885
C  -1.030746 2.142403 1.341735
C  3.046471 -1.163525 -0.136286
C  5.089987 0.501719 0.934164
C  4.054781 1.165821 0.047078
C  5.501533 -0.836009 0.345776
C  2.869281 0.283394 -0.255382
C  4.315234 -1.691534 0.074022
C  1.94244 -2.084118 -0.285338
C  -1.496094 -0.702327 0.677316
C  -2.13869 0.075683 1.806921
C  0.518733 -1.62536 -0.35772
C  -2.173787 -0.990057 -0.519282
C  -0.149425 -1.058251 0.724222
C  -0.185593 -1.881539 -1.518158
C  -1.53068 -1.569045 -1.599727
C  -4.378957 0.877194 -0.754757
H  -2.006315 4.04537 1.140679
H  0.116385 5.082842 1.008756
H  0.898193 3.557831 0.612479
H  1.02516 4.569581 -1.551909
H  -0.463541 5.483738 -1.300108
H  -1.289725 3.616291 -2.621493
H  -0.198065 2.486836 -1.809433
H  -0.290692 1.561473 0.781869
H  -0.594003 2.365248 2.324508
H  5.964517 1.143585 1.039007
H  4.684389 0.350896 1.937623
H  4.506077 1.434213 -0.915574
H  3.685389 2.094848 0.485068
H  6.182785 -1.377861 1.004448
H  6.033775 -0.690842 -0.602091
H  -1.583691 -0.068512 2.736784
H  -3.148859 -0.281551 1.996667
H  0.311284 -2.331851 -2.367218
H  -2.066973 -1.793469 -2.50985
H  -5.442974 0.91554 -0.992491
H  -3.811078 1.366438 -1.542125
H  -4.197754 1.353955 0.201976
H  3.693966 -3.439163 -0.153066
elementType: Cl S O C H
totalener: -2161.10540020 hartree
nucrepener: 3451.85198690 hartree
electener: -5612.95738710 hartree
oneelecener: -9834.52241280 hartree
twoeener: 4221.56502571 hartree
cpcmener: -0.04440879 hartree
kineticenergy: 2154.04860164 hartree
xcener: -162.931093768611 hartree
chargesum: 0.0000000
charge: -0.067480 0.859299 -0.402279 -0.356966 -0.479058 -0.302428 -0.434074 -0.554265 -0.542119 0.223425 -0.211156 -0.117704 0.006833 -0.039264 -0.295402 -0.136287 -0.097238 -0.088008 0.322672 0.304472 0.368216 -0.014087 -0.033657 0.173541 -0.072284 -0.056530 -0.145365 -0.099286 -0.277168 0.098089 0.085833 0.081788 0.076984 0.078289 0.094188 0.070324 0.042189 0.103295 0.083216 0.084244 0.101984 0.095253 0.100068 0.110766 0.116427 0.139537 0.147683 0.156295 0.149248 0.136007 0.146176 0.265767
qa: -0.0675 0.8593 -0.4023 -0.3570 -0.4791 -0.3024 -0.4341 -0.5543 -0.5421 0.2234 -0.2112 -0.1177 0.0068 -0.0393 -0.2954 -0.1363 -0.0972 -0.0880 0.3227 0.3045 0.3682 -0.0141 -0.0337 0.1735 -0.0723 -0.0565 -0.1454 -0.0993 -0.2772 0.0981 0.0858 0.0818 0.0770 0.0783 0.0942 0.0703 0.0422 0.1033 0.0832 0.0842 0.1020 0.0953 0.1001 0.1108 0.1164 0.1395 0.1477 0.1563 0.1492 0.1360 0.1462 0.2658
va: 1.2754 5.5384 1.9473 1.9248 1.9922 2.2629 2.0773 1.9211 1.9133 3.8254 3.9563 3.9079 3.9546 4.0258 3.4883 3.9300 3.9121 3.9394 3.8748 3.9111 3.8008 3.6404 3.8046 3.5050 3.7868 3.9648 4.0596 3.9191 3.8757 1.0050 1.0174 1.0168 1.0177 1.0115 0.9982 0.9999 0.9736 1.0044 1.0134 1.0100 1.0093 1.0172 1.0215 1.0071 1.0158 1.0160 1.0059 1.0187 1.0147 1.0146 1.0193 1.0612
dispcorr: -0.033854513 hartree
energy: -2161.139254713432
dipole: 10.82577 -5.91454 4.91123 30.57069 -28.15752 2.41317 -4.41218 4.85042 0.43824
magnitude: 5.48960 au
magnitude: 13.95344 debye
