program: Orca
programVersion: 5.0.2
elementType: Cl S O O O O O O O C C C C C C C C C C C C C C C C C C C C H H H H H H H H H H H H H H H H H H H H H H H
charge: 0
multiplicity: 1
keywords: wb97x-d3
keywords: def2-TZVPP
keywords: def2/J RIJCOSX
keywords: DEFGRID2
keywords: scfconv7
keywords: smallprint printgap noloewdin
keywords: NOSOSCF
formula: C20H23ClO7S
InChI: InChI=1/C20H23ClO7S/c1-29(25,26)17-8-7-13(20(24)18-15(22)5-2-6-16(18)23)19(21)14(17)11-27-10-12-4-3-9-28-12/h7-8,12,22H,2-6,9-11H2,1H3
52 atoms
Cl 0.839365 -0.783131 2.157612
S  -3.930766 -0.674407 -0.699017
O  -2.053098 3.721552 -0.226535
O  -2.263678 1.457162 1.446199
O  1.702585 0.56198 -0.925035
O  4.52539 -3.033043 0.123652
O  2.081444 -3.435469 -0.080124
O  -4.424122 -1.625222 -1.693823
O  -4.640833 -0.607376 0.574342
C  -1.359313 3.631623 1.011284
C  -0.06814 4.429457 0.826587
C  0.18268 4.308322 -0.673187
C  -1.233967 4.325306 -1.221362
C  -1.058203 2.187018 1.35478
C  2.999609 -1.286057 -0.281215
C  5.098696 0.536588 0.344383
C  4.001685 1.031096 -0.579193
C  5.478625 -0.888014 -0.015793
C  2.795076 0.127194 -0.601928
C  4.284166 -1.772546 -0.0594
C  1.90109 -2.221044 -0.208869
C  -1.479009 -0.711103 0.726948
C  -2.08006 0.120013 1.842737
C  0.476739 -1.770025 -0.288717
C  -2.189628 -1.054842 -0.434747
C  -0.1436 -1.107767 0.764231
C  -0.263913 -2.105422 -1.405053
C  -1.597996 -1.750502 -1.477739
C  -3.915994 0.933599 -1.445191
H  -1.991066 4.060537 1.797016
H  -0.223533 5.473002 1.107063
H  0.753153 4.045209 1.432953
H  0.687561 3.369297 -0.91069
H  0.788623 5.121441 -1.072467
H  -1.568954 5.353111 -1.404949
H  -1.339116 3.770346 -2.156495
H  -0.388801 1.757295 0.597699
H  -0.526841 2.163268 2.315263
H  5.973861 1.181658 0.270862
H  4.760184 0.575131 1.382536
H  4.379432 1.086757 -1.607242
H  3.671738 2.036878 -0.314434
H  6.201856 -1.306865 0.686395
H  5.950918 -0.919562 -1.005079
H  -1.450265 0.062717 2.733141
H  -3.051411 -0.271656 2.126814
H  0.197493 -2.636331 -2.227178
H  -2.163433 -2.023594 -2.357144
H  -3.350634 0.896291 -2.374757
H  -3.476842 1.657596 -0.764727
H  -4.952825 1.200024 -1.656104
H  3.653848 -3.52736 0.057934
elementType: Cl S O C H
totalener: -2161.10675382 hartree
nucrepener: 3427.79848500 hartree
electener: -5588.90523882 hartree
oneelecener: -9786.32327673 hartree
twoeener: 4197.41803791 hartree
cpcmener: -0.04701471 hartree
kineticenergy: 2154.05586630 hartree
xcener: -162.933155226976 hartree
chargesum: -0.0000000
charge: -0.070896 0.864653 -0.408256 -0.354720 -0.476272 -0.303595 -0.432018 -0.554786 -0.547040 0.193787 -0.173039 -0.151109 0.044436 -0.022016 -0.298854 -0.131482 -0.100005 -0.089957 0.324906 0.307714 0.360674 -0.092128 -0.021847 0.173251 -0.040971 0.002854 -0.144547 -0.116113 -0.242865 0.080953 0.091752 0.081044 0.059917 0.085714 0.080011 0.079082 0.074084 0.086448 0.083189 0.083570 0.101896 0.091922 0.100182 0.111855 0.112942 0.145480 0.148577 0.145820 0.136630 0.113063 0.139797 0.266315
qa: -0.0709 0.8647 -0.4083 -0.3547 -0.4763 -0.3036 -0.4320 -0.5548 -0.5470 0.1938 -0.1730 -0.1511 0.0444 -0.0220 -0.2989 -0.1315 -0.1000 -0.0900 0.3249 0.3077 0.3607 -0.0921 -0.0218 0.1733 -0.0410 0.0029 -0.1445 -0.1161 -0.2429 0.0810 0.0918 0.0810 0.0599 0.0857 0.0800 0.0791 0.0741 0.0864 0.0832 0.0836 0.1019 0.0919 0.1002 0.1119 0.1129 0.1455 0.1486 0.1458 0.1366 0.1131 0.1398 0.2663
va: 1.2717 5.5190 1.9607 1.9468 2.0025 2.2613 2.0790 1.9178 1.9149 3.9674 3.9417 3.9291 3.9206 3.9285 3.5189 3.9245 3.9128 3.9436 3.8834 3.9013 3.8079 3.7019 3.8362 3.5221 3.7773 3.8945 4.0588 3.9764 3.8391 1.0043 1.0082 1.0174 1.0324 1.0161 0.9916 0.9915 0.9861 1.0045 1.0129 1.0100 1.0081 1.0191 1.0214 1.0069 1.0137 1.0104 1.0038 1.0212 1.0063 1.0541 1.0161 1.0625
dispcorr: -0.032769539 hartree
energy: -2161.139523356004
dipole: 11.71341 -6.28807 5.42534 31.17453 -29.07365 2.10088 -6.77324 6.25988 -0.51336
magnitude: 5.84050 au
magnitude: 14.84538 debye
