program: Orca
programVersion: 5.0.2
elementType: Cl S O O O O O O O C C C C C C C C C C C C C C C C C C C C H H H H H H H H H H H H H H H H H H H H H H H
charge: 0
multiplicity: 1
keywords: wb97x-d3
keywords: def2-TZVPP
keywords: def2/J RIJCOSX
keywords: DEFGRID2
keywords: scfconv7
keywords: smallprint printgap noloewdin
keywords: NOSOSCF
formula: C20H23ClO7S
InChI: InChI=1/C20H23ClO7S/c1-29(25,26)17-8-7-13(20(24)18-15(22)5-2-6-16(18)23)19(21)14(17)11-27-10-12-4-3-9-28-12/h7-8,12,22H,2-6,9-11H2,1H3
52 atoms
Cl 1.192471 -0.35745 -2.143036
S  -3.670049 -0.438949 0.571962
O  -1.477971 3.777233 1.194593
O  -1.732233 1.914235 -0.95474
O  1.888207 0.017607 1.157435
O  4.544491 -3.415362 -0.633172
O  2.089819 -3.652019 -0.70764
O  -4.319134 0.132686 -0.59494
O  -4.319931 -1.528981 1.284918
C  -0.713447 3.84049 0.001837
C  -1.474527 4.775638 -0.953746
C  -2.879573 4.811249 -0.36165
C  -2.575841 4.661358 1.119766
C  -0.495666 2.444265 -0.543385
C  3.10959 -1.720333 0.146851
C  5.427117 -0.456682 1.287598
C  4.222226 0.410579 0.962489
C  5.627467 -1.50602 0.207355
C  2.961244 -0.406755 0.791856
C  4.367575 -2.246636 -0.098236
C  1.961802 -2.512309 -0.257024
C  -1.192526 -0.441981 -0.82588
C  -1.650145 0.720425 -1.684072
C  0.570479 -1.982024 -0.127394
C  -2.002457 -1.012103 0.168014
C  0.090863 -0.967628 -0.946738
C  -0.279232 -2.557914 0.795385
C  -1.564717 -2.071383 0.945935
C  -3.350043 0.859525 1.750588
H  0.280389 4.248643 0.228915
H  -1.030304 5.773117 -0.936284
H  -1.455587 4.428405 -1.986244
H  -3.472161 3.970276 -0.722381
H  -3.417599 5.731693 -0.588404
H  -2.323675 5.633633 1.565499
H  -3.403761 4.239436 1.693575
H  0.203802 2.510038 -1.389531
H  -0.017505 1.816092 0.220069
H  6.324755 0.154991 1.381259
H  5.281441 -0.946072 2.253604
H  4.395586 0.946555 0.021439
H  4.044394 1.164959 1.72846
H  6.404223 -2.224081 0.475423
H  5.958699 -1.030581 -0.723582
H  -2.643711 0.523205 -2.0752
H  -0.977601 0.831332 -2.538866
H  0.066063 -3.3749 1.414328
H  -2.226927 -2.521234 1.671428
H  -2.825114 0.444264 2.607653
H  -4.32344 1.23716 2.063856
H  -2.765815 1.652996 1.293933
H  3.629101 -3.805078 -0.795867
totalener: -2161.07189110 hartree
nucrepener: 3408.21486018 hartree
electener: -5569.28675128 hartree
oneelecener: -9746.44795226 hartree
twoeener: 4177.16120098 hartree
kineticenergy: 2154.12872707 hartree
xcener: -162.936617923151 hartree
chargesum: 0.0000000
charge: -0.078673 0.844280 -0.364486 -0.313686 -0.363878 -0.277580 -0.363427 -0.483036 -0.488308 0.170681 -0.176272 -0.135445 0.012162 -0.036117 -0.337811 -0.151535 -0.096836 -0.102294 0.291207 0.268260 0.287581 -0.098235 -0.047967 0.205413 -0.055439 0.019715 -0.108565 -0.116690 -0.256946 0.068070 0.084664 0.075231 0.086465 0.072837 0.076394 0.073717 0.075319 0.112032 0.083034 0.083532 0.082650 0.094088 0.100609 0.097151 0.139029 0.098935 0.121789 0.140794 0.124490 0.122725 0.100064 0.240308
qa: -0.0787 0.8443 -0.3645 -0.3137 -0.3639 -0.2776 -0.3634 -0.4830 -0.4883 0.1707 -0.1763 -0.1354 0.0122 -0.0361 -0.3378 -0.1515 -0.0968 -0.1023 0.2912 0.2683 0.2876 -0.0982 -0.0480 0.2054 -0.0554 0.0197 -0.1086 -0.1167 -0.2569 0.0681 0.0847 0.0752 0.0865 0.0728 0.0764 0.0737 0.0753 0.1120 0.0830 0.0835 0.0826 0.0941 0.1006 0.0972 0.1390 0.0989 0.1218 0.1408 0.1245 0.1227 0.1001 0.2403
va: 1.2634 5.5685 1.9979 1.9593 2.1117 2.2866 2.1511 1.9881 1.9988 3.9626 3.9289 3.9197 3.9497 3.8849 3.4475 3.9160 3.8246 3.9232 3.9449 3.9347 3.8903 3.7255 3.8848 3.5120 3.8553 3.8997 4.0630 3.9933 3.8668 0.9973 1.0084 1.0236 1.0252 1.0178 0.9963 0.9936 1.0079 1.0073 1.0136 1.0088 1.0123 1.0314 1.0229 1.0088 1.0111 1.0084 1.0115 1.0285 1.0168 1.0194 1.0447 1.1007
dispcorr: -0.032919644 hartree
energy: -2161.104810739091
dipole: 3.84686 -0.72282 3.12404 29.15417 -27.99905 1.15512 9.77734 -9.41167 0.36567
magnitude: 3.35077 au
magnitude: 8.51698 debye
