program: Orca
programVersion: 5.0.2
elementType: Cl S O O O O O O O C C C C C C C C C C C C C C C C C C C C H H H H H H H H H H H H H H H H H H H H H H H
charge: 0
multiplicity: 1
keywords: wb97x-d3
keywords: def2-TZVPP
keywords: def2/J RIJCOSX
keywords: DEFGRID2
keywords: scfconv7
keywords: smallprint printgap noloewdin
keywords: NOSOSCF
formula: C20H23ClO7S
InChI: InChI=1/C20H23ClO7S/c1-29(25,26)17-8-7-13(20(24)18-15(22)5-2-6-16(18)23)19(21)14(17)11-27-10-12-4-3-9-28-12/h7-8,12,22H,2-6,9-11H2,1H3
52 atoms
Cl 0.965269 -0.272733 -2.101832
S  -4.02402 -0.862296 0.295884
O  -1.649887 2.894978 0.883722
O  -2.488271 1.552961 -1.589924
O  1.722069 0.657026 1.174107
O  4.549237 -2.777334 -0.293333
O  2.129107 -3.214655 -0.099786
O  -4.599427 -0.903505 -1.03792
O  -4.467853 -1.826413 1.292316
C  -0.760898 2.573866 -0.162393
C  0.315466 3.654654 -0.088109
C  0.407076 3.93624 1.418299
C  -0.852517 3.254228 1.989231
C  -1.500374 2.549512 -1.482584
C  3.020467 -1.08745 0.294156
C  5.10565 0.805278 -0.117049
C  4.016205 1.180976 0.87125
C  5.494684 -0.652076 0.064622
C  2.806271 0.274009 0.790751
C  4.299803 -1.544809 0.022431
C  1.922885 -2.019002 0.114234
C  -1.456211 -0.546349 -0.882072
C  -2.056037 0.283778 -2.002824
C  0.489813 -1.594338 0.166569
C  -2.225856 -1.044253 0.17961
C  -0.094011 -0.844455 -0.846892
C  -0.308651 -2.078427 1.184954
C  -1.660988 -1.795173 1.197859
C  -4.26488 0.759824 0.990576
H  -0.291156 1.603904 0.033331
H  1.259281 3.318425 -0.516728
H  0.00063 4.547478 -0.635467
H  0.424164 5.005791 1.626172
H  1.307743 3.501891 1.850052
H  -0.570002 2.366446 2.567477
H  -1.439768 3.906962 2.636894
H  -2.012538 3.506771 -1.615648
H  -0.764439 2.457498 -2.293437
H  4.75183 0.963952 -1.138712
H  5.979414 1.443988 0.014722
H  3.678776 2.209261 0.734104
H  4.402948 1.118779 1.895256
H  5.991917 -0.797192 1.031027
H  6.204704 -0.98383 -0.695076
H  -2.929641 -0.23026 -2.393841
H  -1.33802 0.368372 -2.821937
H  0.123507 -2.683466 1.97041
H  -2.282486 -2.18689 1.989904
H  -3.760631 0.817181 1.951772
H  -5.340338 0.869857 1.127189
H  -3.881653 1.518483 0.318252
H  3.670124 -3.269985 -0.263864
totalener: -2161.06996671 hartree
nucrepener: 3489.12218871 hartree
electener: -5650.19215542 hartree
oneelecener: -9907.99558853 hartree
twoeener: 4257.80343311 hartree
kineticenergy: 2154.13873589 hartree
xcener: -162.938745519288 hartree
chargesum: 0.0000000
charge: -0.079581 0.843487 -0.352696 -0.322998 -0.392034 -0.275821 -0.360401 -0.481167 -0.490995 0.202727 -0.192574 -0.128714 0.027084 -0.001150 -0.288468 -0.138034 -0.118267 -0.109502 0.290332 0.271689 0.270244 -0.114180 -0.052958 0.170534 -0.055311 0.044976 -0.082821 -0.110548 -0.291471 0.028810 0.069035 0.079502 0.076164 0.068561 0.064929 0.077923 0.092277 0.069379 0.082848 0.082066 0.089399 0.093262 0.097941 0.101558 0.149342 0.099033 0.118962 0.140778 0.114097 0.132654 0.149379 0.240718
qa: -0.0796 0.8435 -0.3527 -0.3230 -0.3920 -0.2758 -0.3604 -0.4812 -0.4910 0.2027 -0.1926 -0.1287 0.0271 -0.0011 -0.2885 -0.1380 -0.1183 -0.1095 0.2903 0.2717 0.2702 -0.1142 -0.0530 0.1705 -0.0553 0.0450 -0.0828 -0.1105 -0.2915 0.0288 0.0690 0.0795 0.0762 0.0686 0.0649 0.0779 0.0923 0.0694 0.0828 0.0821 0.0894 0.0933 0.0979 0.1016 0.1493 0.0990 0.1190 0.1408 0.1141 0.1327 0.1494 0.2407
va: 1.2633 5.5608 1.9962 1.9774 2.0843 2.2893 2.1545 1.9875 1.9944 3.8208 3.9490 3.9033 3.9657 3.9571 3.4663 3.9130 3.8800 3.9266 3.9269 3.9158 3.8875 3.6674 3.9016 3.5622 3.8493 3.8708 4.0375 3.9866 3.8751 1.0621 1.0223 1.0174 1.0122 1.0246 0.9973 0.9894 1.0139 1.0117 1.0118 1.0147 1.0192 1.0132 1.0099 1.0238 1.0096 1.0087 1.0116 1.0288 1.0156 1.0165 1.0280 1.1000
dispcorr: -0.035551234 hartree
energy: -2161.105517941415
dipole: 11.38781 -7.76303 3.62478 27.56089 -25.98979 1.57109 10.09396 -9.54598 0.54798
magnitude: 3.98844 au
magnitude: 10.13781 debye
