program: Orca
programVersion: 5.0.2
elementType: Cl S O O O O O O O C C C C C C C C C C C C C C C C C C C C H H H H H H H H H H H H H H H H H H H H H H H
charge: 0
multiplicity: 1
keywords: wb97x-d3
keywords: def2-TZVPP
keywords: def2/J RIJCOSX
keywords: DEFGRID2
keywords: scfconv7
keywords: smallprint printgap noloewdin
keywords: NOSOSCF
formula: C20H23ClO7S
InChI: InChI=1/C20H23ClO7S/c1-29(25,26)17-8-7-13(20(24)18-15(22)5-2-6-16(18)23)19(21)14(17)11-27-10-12-4-3-9-28-12/h7-8,12,22H,2-6,9-11H2,1H3
52 atoms
Cl 0.796235 0.073346 -1.648708
S  -4.12143 -1.452977 0.304482
O  -0.940456 5.07854 -0.568144
O  -1.729212 1.577148 -0.42662
O  1.348095 -0.06383 1.631972
O  4.562123 -2.689894 -0.534355
O  2.190822 -3.39992 -0.598303
O  -4.724148 -1.135834 -0.980229
O  -4.581002 -2.611953 1.051902
C  -1.031932 3.780231 -0.006579
C  0.385031 3.384803 0.412529
C  1.037546 4.743392 0.641451
C  0.375634 5.577902 -0.445766
C  -1.650803 2.84336 -1.028807
C  2.834341 -1.356889 0.35151
C  4.689012 0.78716 0.463917
C  3.536678 0.83314 1.450443
C  5.24333 -0.625061 0.375502
C  2.456663 -0.190846 1.163391
C  4.162643 -1.602395 0.052341
C  1.852572 -2.316608 -0.117304
C  -1.580559 -0.727735 -0.646292
C  -2.1179 0.530158 -1.279617
C  0.387524 -2.037162 -0.045939
C  -2.3439 -1.625215 0.104002
C  -0.210272 -0.968858 -0.700891
C  -0.413066 -2.928096 0.648433
C  -1.775695 -2.721109 0.733842
C  -4.265673 -0.030844 1.378868
H  -1.685389 3.820628 0.875814
H  0.397937 2.728994 1.281253
H  0.88885 2.851618 -0.398408
H  2.124411 4.7237 0.554437
H  0.790951 5.131546 1.632348
H  0.33129 6.642669 -0.206411
H  0.918621 5.4745 -1.394496
H  -2.640415 3.208661 -1.337167
H  -1.018077 2.812735 -1.928373
H  4.346887 1.105139 -0.524062
H  5.476019 1.48035 0.762084
H  3.064341 1.816338 1.478387
H  3.905162 0.64249 2.464969
H  5.699046 -0.917839 1.32855
H  6.027658 -0.710791 -0.378579
H  -3.199321 0.49666 -1.416654
H  -1.685312 0.646669 -2.280729
H  0.034381 -3.781954 1.138635
H  -2.3952 -3.409874 1.289606
H  -3.776255 0.837269 0.944151
H  -3.815481 -0.267734 2.339992
H  -5.330923 0.160343 1.505052
H  3.747023 -3.262177 -0.674763
totalener: -2161.06972792 hartree
nucrepener: 3398.40381283 hartree
electener: -5559.47354075 hartree
oneelecener: -9726.15763072 hartree
twoeener: 4166.68408998 hartree
kineticenergy: 2154.13985372 hartree
xcener: -162.935521023543 hartree
chargesum: -0.0000000
charge: -0.083119 0.828441 -0.344840 -0.310981 -0.353331 -0.278447 -0.369154 -0.473591 -0.482695 0.174831 -0.185121 -0.128566 0.045615 -0.032983 -0.281149 -0.138318 -0.109600 -0.111518 0.232666 0.272235 0.302242 0.004025 -0.103749 0.164582 -0.055621 -0.025550 -0.099636 -0.103159 -0.277475 0.069905 0.095154 0.054397 0.062754 0.077767 0.069154 0.055036 0.089631 0.065786 0.080967 0.080380 0.089199 0.097984 0.097271 0.099910 0.134329 0.111718 0.121862 0.147946 0.124535 0.128383 0.129094 0.240807
qa: -0.0831 0.8284 -0.3448 -0.3110 -0.3533 -0.2784 -0.3692 -0.4736 -0.4827 0.1748 -0.1851 -0.1286 0.0456 -0.0330 -0.2811 -0.1383 -0.1096 -0.1115 0.2327 0.2722 0.3022 0.0040 -0.1037 0.1646 -0.0556 -0.0256 -0.0996 -0.1032 -0.2775 0.0699 0.0952 0.0544 0.0628 0.0778 0.0692 0.0550 0.0896 0.0658 0.0810 0.0804 0.0892 0.0980 0.0973 0.0999 0.1343 0.1117 0.1219 0.1479 0.1245 0.1284 0.1291 0.2408
va: 1.2610 5.5896 2.0331 1.9221 2.1192 2.2851 2.1430 1.9829 2.0080 3.9623 3.9056 3.9099 3.9925 3.9600 3.4220 3.9037 3.8467 3.9271 3.9913 3.9161 3.8545 3.7313 3.8643 3.5469 3.8851 3.9956 4.0497 3.9594 3.8777 1.0032 1.0332 1.0279 1.0185 1.0081 0.9913 0.9855 1.0040 1.0076 1.0121 1.0152 1.0244 1.0145 1.0097 1.0240 1.0325 1.0045 1.0158 1.0259 1.0243 1.0142 1.0153 1.0977
dispcorr: -0.032100967 hartree
energy: -2161.101828883535
dipole: 11.11419 -8.28542 2.82877 30.09502 -28.79936 1.29566 9.10427 -8.24803 0.85625
magnitude: 3.22705 au
magnitude: 8.20250 debye
