program: Orca
programVersion: 5.0.2
elementType: Cl S O O O O O O O C C C C C C C C C C C C C C C C C C C C H H H H H H H H H H H H H H H H H H H H H H H
charge: 0
multiplicity: 1
keywords: wb97x-d3
keywords: def2-TZVPP
keywords: def2/J RIJCOSX
keywords: DEFGRID2
keywords: scfconv7
keywords: smallprint printgap noloewdin
keywords: NOSOSCF
formula: C20H23ClO7S
InChI: InChI=1/C20H23ClO7S/c1-29(25,26)17-8-7-13(20(24)18-15(22)5-2-6-16(18)23)19(21)14(17)11-27-10-12-4-3-9-28-12/h7-8,12,22H,2-6,9-11H2,1H3
52 atoms
Cl 0.883435 -0.262073 -2.159511
S  -4.042021 -0.899984 0.353979
O  -1.768006 2.912761 0.981416
O  -2.547036 1.562289 -1.509861
O  1.741259 0.614802 1.046341
O  4.500369 -2.842047 -0.499392
O  2.084628 -3.261975 -0.229372
O  -4.648313 -0.931244 -0.966415
O  -4.458366 -1.875821 1.350963
C  -0.845739 2.572193 -0.040481
C  0.250449 3.627798 0.029367
C  0.300075 3.909512 1.525023
C  -1.171962 3.794283 1.913591
C  -1.544944 2.543373 -1.385115
C  3.00302 -1.142198 0.139453
C  5.091521 0.73643 -0.31986
C  4.036338 1.111703 0.705172
C  5.472752 -0.725841 -0.164332
C  2.814016 0.220444 0.643058
C  4.269659 -1.608518 -0.173215
C  1.893232 -2.065208 -0.007208
C  -1.504521 -0.555348 -0.878891
C  -2.134278 0.300274 -1.962715
C  0.465105 -1.632907 0.091771
C  -2.247327 -1.076822 0.191146
C  -0.142903 -0.855547 -0.886876
C  -0.307377 -2.139228 1.119204
C  -1.658198 -1.852633 1.175826
C  -4.273381 0.712615 1.073388
H  -0.405625 1.59522 0.181555
H  1.195184 3.2641 -0.373663
H  -0.03439 4.526001 -0.528986
H  0.722454 4.883474 1.772904
H  0.897148 3.143054 2.021304
H  -1.30377 3.40901 2.928342
H  -1.667664 4.770909 1.865506
H  -2.035063 3.508173 -1.545599
H  -0.787267 2.426896 -2.172518
H  4.707574 0.908388 -1.328395
H  5.974833 1.365886 -0.209125
H  3.708352 2.145915 0.593909
H  4.451446 1.028039 1.716419
H  6.001288 -0.884068 0.783213
H  6.153418 -1.057275 -0.950547
H  -3.022224 -0.200958 -2.337777
H  -1.441414 0.399574 -2.801356
H  0.143285 -2.765184 1.877412
H  -2.25946 -2.26108 1.975017
H  -3.718446 0.773499 2.005976
H  -5.341751 0.799908 1.269715
H  -3.942422 1.48415 0.388337
H  3.619465 -3.328753 -0.442678
totalener: -2161.07001516 hartree
nucrepener: 3475.37573702 hartree
electener: -5636.44575218 hartree
oneelecener: -9880.63523839 hartree
twoeener: 4244.18948621 hartree
kineticenergy: 2154.14068251 hartree
xcener: -162.940969631894 hartree
chargesum: 0.0000000
charge: -0.079653 0.843480 -0.357087 -0.324010 -0.392719 -0.276146 -0.361173 -0.481372 -0.491539 0.176002 -0.172165 -0.142496 0.044091 -0.008371 -0.283282 -0.138103 -0.118147 -0.109026 0.285801 0.270440 0.273537 -0.125125 -0.055829 0.179294 -0.038136 0.019514 -0.084580 -0.102547 -0.292570 0.065649 0.068867 0.078164 0.073473 0.080337 0.059042 0.062534 0.093431 0.065333 0.082659 0.081892 0.090936 0.092041 0.097816 0.101614 0.149640 0.099374 0.119432 0.141476 0.116500 0.133901 0.147049 0.240759
qa: -0.0797 0.8435 -0.3571 -0.3240 -0.3927 -0.2761 -0.3612 -0.4814 -0.4915 0.1760 -0.1722 -0.1425 0.0441 -0.0084 -0.2833 -0.1381 -0.1181 -0.1090 0.2858 0.2704 0.2735 -0.1251 -0.0558 0.1793 -0.0381 0.0195 -0.0846 -0.1025 -0.2926 0.0656 0.0689 0.0782 0.0735 0.0803 0.0590 0.0625 0.0934 0.0653 0.0827 0.0819 0.0909 0.0920 0.0978 0.1016 0.1496 0.0994 0.1194 0.1415 0.1165 0.1339 0.1470 0.2408
va: 1.2632 5.5597 2.0042 1.9756 2.0858 2.2886 2.1539 1.9867 1.9936 3.8165 3.9405 3.9143 3.9803 3.9481 3.4739 3.9072 3.8795 3.9265 3.9293 3.9229 3.8831 3.6726 3.9006 3.5444 3.8354 3.8735 4.0403 3.9852 3.8731 1.0470 1.0226 1.0182 1.0153 1.0254 0.9898 0.9856 1.0108 1.0140 1.0118 1.0147 1.0207 1.0136 1.0100 1.0236 1.0102 1.0084 1.0121 1.0285 1.0164 1.0152 1.0305 1.0998
dispcorr: -0.034921783 hartree
energy: -2161.104936939474
dipole: 10.98015 -7.32704 3.65310 28.33896 -26.62727 1.71169 10.18433 -9.71558 0.46875
magnitude: 4.06138 au
magnitude: 10.32320 debye
