program: Orca
programVersion: 5.0.2
elementType: Cl S O O O O O O O C C C C C C C C C C C C C C C C C C C C H H H H H H H H H H H H H H H H H H H H H H H
charge: 0
multiplicity: 1
keywords: wb97x-d3
keywords: def2-TZVPP
keywords: def2/J RIJCOSX
keywords: DEFGRID2
keywords: scfconv7
keywords: smallprint printgap noloewdin
keywords: NOSOSCF
formula: C20H23ClO7S
InChI: InChI=1/C20H23ClO7S/c1-29(25,26)17-8-7-13(20(24)18-15(22)5-2-6-16(18)23)19(21)14(17)11-27-10-12-4-3-9-28-12/h7-8,12,22H,2-6,9-11H2,1H3
52 atoms
Cl 0.936852 -0.496628 -2.107793
S  -4.064155 -1.01603 0.246763
O  0.263392 4.293033 -0.395916
O  -2.034414 1.642237 -1.199121
O  1.420173 0.350865 1.250074
O  4.571415 -2.801028 -0.152344
O  2.167723 -3.446496 -0.075922
O  -4.634972 -0.997284 -1.089863
O  -4.56025 -1.969736 1.226764
C  -0.992525 3.631747 -0.395953
C  -1.464677 3.61233 1.060721
C  -0.153405 3.70847 1.834275
C  0.660343 4.612471 0.921416
C  -0.777439 2.245538 -0.983145
C  2.870484 -1.247597 0.332264
C  4.76403 0.808298 -0.13293
C  3.601331 1.154598 0.77914
C  5.291115 -0.580683 0.192069
C  2.519684 0.095231 0.806481
C  4.193991 -1.589798 0.123893
C  1.862427 -2.268941 0.110114
C  -1.474748 -0.686098 -0.861395
C  -1.989391 0.377238 -1.813254
C  0.410877 -1.914912 0.092324
C  -2.278387 -1.270835 0.13033
C  -0.134495 -1.065496 -0.864977
C  -0.421125 -2.484486 1.035293
C  -1.767206 -2.169419 1.051571
C  -4.229459 0.609075 0.96362
H  -1.692199 4.182143 -1.035357
H  -2.097705 4.477676 1.26918
H  -2.040834 2.719769 1.302677
H  0.316193 2.727865 1.930614
H  -0.276023 4.121446 2.835595
H  0.45834 5.669523 1.139071
H  1.738624 4.458973 1.014147
H  -0.229381 2.339135 -1.929548
H  -0.157868 1.653219 -0.298845
H  4.439346 0.837008 -1.175813
H  5.561403 1.544839 -0.032013
H  3.132154 2.098618 0.495294
H  3.955001 1.285186 1.808158
H  5.720571 -0.602209 1.20039
H  6.088679 -0.884372 -0.487987
H  -3.002318 0.144565 -2.128052
H  -1.371052 0.402091 -2.714785
H  -0.017321 -3.170931 1.766946
H  -2.418413 -2.627857 1.781298
H  -3.812881 1.358003 0.296903
H  -3.723624 0.627848 1.926426
H  -5.297027 0.775137 1.10492
H  3.746716 -3.373346 -0.15728
totalener: -2161.07137289 hartree
nucrepener: 3449.13379878 hartree
electener: -5610.20517166 hartree
oneelecener: -9827.53946368 hartree
twoeener: 4217.33429201 hartree
kineticenergy: 2154.12125803 hartree
xcener: -162.936419966838 hartree
chargesum: -0.0000000
charge: -0.070185 0.836784 -0.353821 -0.330039 -0.394068 -0.275016 -0.364893 -0.475603 -0.483681 0.171379 -0.149553 -0.167595 0.036653 -0.014008 -0.263593 -0.146966 -0.097549 -0.111530 0.251527 0.270912 0.277436 -0.038071 -0.073183 0.244561 -0.100318 -0.048956 -0.104676 -0.091299 -0.309310 0.068839 0.087958 0.058840 0.082841 0.073585 0.070708 0.059451 0.085605 0.061401 0.085112 0.081463 0.089543 0.095835 0.096864 0.100641 0.157455 0.108060 0.122415 0.146205 0.139272 0.124950 0.136610 0.241007
qa: -0.0702 0.8368 -0.3538 -0.3300 -0.3941 -0.2750 -0.3649 -0.4756 -0.4837 0.1714 -0.1496 -0.1676 0.0367 -0.0140 -0.2636 -0.1470 -0.0975 -0.1115 0.2515 0.2709 0.2774 -0.0381 -0.0732 0.2446 -0.1003 -0.0490 -0.1047 -0.0913 -0.3093 0.0688 0.0880 0.0588 0.0828 0.0736 0.0707 0.0595 0.0856 0.0614 0.0851 0.0815 0.0895 0.0958 0.0969 0.1006 0.1575 0.1081 0.1224 0.1462 0.1393 0.1249 0.1366 0.2410
va: 1.2743 5.5791 2.0132 1.9521 2.0734 2.2904 2.1459 1.9874 2.0027 4.0024 3.8974 3.9459 3.9717 3.9639 3.4280 3.9243 3.8562 3.9224 3.9423 3.9172 3.8992 3.6033 3.8070 3.4584 3.9086 3.9582 4.0675 3.9512 3.8825 1.0055 1.0078 1.0285 1.0333 1.0198 0.9922 0.9869 1.0109 0.9859 1.0121 1.0153 1.0253 1.0128 1.0096 1.0240 1.0173 1.0154 1.0128 1.0266 1.0241 1.0085 1.0205 1.0953
dispcorr: -0.034102783 hartree
energy: -2161.105475668595
dipole: 7.59716 -4.95772 2.63944 29.47102 -28.18342 1.28761 12.62712 -11.63029 0.99683
magnitude: 3.10133 au
magnitude: 7.88294 debye
