program: Gaussian 09
title: 000006287
version: EM64L-G09RevD.01
frameworkgroup: C1[X(C5H11NO2)]
method: RPBEPBE
basis: SDD
operation: Freq
keyword: #p
keyword: freq=noraman
keyword: PBEPBE/SDD
title: #p freq=noraman PBEPBE/SDD
converged: YES YES NO NO
title: Mulliken charges:
elementType: O O N C C C C C H H H H H H H H H H H
charge: -0.415455 -0.236277 -0.572729 -0.023445 -0.209193 -0.704182 -0.724508 0.146283 0.229598 0.257150 0.219142 0.218128 0.213822 0.236391 0.213057 0.220486 0.287729 0.273091 0.370914
chargesum: 0.00000
title: Mulliken charges with hydrogens summed into heavy atoms:
elementType: O O N C C C C C
charge: -0.044541 -0.236277 -0.011909 0.206152 0.047957 -0.053090 -0.054574 0.146283
polarizability: 6.85649305e+01 2.98595392e+00 7.09186069e+01 -5.36704877e-01 1.92499865e+00 6.30875566e+01
1716.lowfreq: -9.7688 -0.0005 -0.0004 0.0010 5.7015 23.5933 36.6645 83.9252 161.9965
frequency: 36.3359 83.7334 161.9908 208.3351 226.8365 230.8687 265.4256 283.8080 346.5746 360.2803 435.1724 499.7779 609.9459 630.2550 677.3336 704.9854 770.0418 851.8053 918.4228 937.1806 960.7676 1028.8996 1074.6546 1109.8062 1129.5665 1183.1401 1206.5005 1233.6396 1280.9285 1305.8489 1348.3310 1373.5294 1382.5454 1403.1393 1465.8195 1472.3593 1483.6292 1490.2606 1647.2262 1649.1167 2977.7242 2981.3124 2996.7811 3049.6690 3071.0086 3073.7242 3078.4271 3082.2994 3449.8163 3487.8021 3572.5110
redmass: 5.0804 3.1120 4.0350 1.1123 1.2174 2.0306 1.6719 1.8177 3.0773 2.5775 2.6994 3.5208 1.5537 2.0812 1.6042 3.2137 3.5916 2.7379 1.1903 2.2226 1.3656 2.7170 1.5039 2.4386 2.0241 2.0244 1.7080 1.4422 1.6185 1.4700 1.3558 1.4027 1.2245 1.2104 1.0515 1.0483 1.0538 1.0454 5.4972 1.1632 1.0356 1.0356 1.0845 1.0862 1.0995 1.0991 1.0993 1.0994 1.0450 1.0638 1.0970
irintensity: 1.0429 0.5616 0.1451 4.5229 0.6908 19.5647 14.4948 36.8800 6.0241 4.6533 12.6155 15.0103 99.9360 31.8200 241.0988 37.5405 3.1580 20.9157 3.6680 9.5966 0.5146 244.6304 7.6493 27.3163 2.8231 2.1045 4.9059 4.5902 22.7626 4.7054 0.3408 7.4124 20.5994 15.2555 3.1241 3.1156 10.6373 22.7349 217.9260 22.4930 30.3540 19.9351 10.5712 12.7119 13.8039 36.7161 51.4757 47.6236 1.0714 11.2436 3.3691
temp: 298.150 k
press: 1.00000 atm
elementType: 8 8 7 6 6 6 6 6 1 1 1 1 1 1 1 1 1 1 1
symmnumber: 1
zpe: 420426.9 jmol-1
zpe.correction: 0.160132 hartree
zpe.thermalcorrener: 0.169983 hartree
zpe.thermalcorrenthalpy: 0.170927 hartree
zpe.thermalcorrgfe: 0.125304 hartree
zpe.sumelectzpe: -401.671004 hartree
zpe.sumelectthermal: -401.661153 hartree
zpe.sumelectthermalent: -401.660209 hartree
zpe.sumelectthermalfe: -401.705832 hartree
dipole: -0.4581 -0.7493 -0.7250
dipole: 1.1388
quadrupole: -46.1881 -47.7169 -52.6489
quadrupole: 0.2774 2.7601 -2.2075
quadrupole: 2.6632 1.1344 -3.7976 0.2774 2.7601 -2.2075
hfenergy: -401.8311364 hartree
pointgroup: C01 [X(C5H11N1O2)]
dipole: -0.0977749 -0.3347029 -0.2813704 debye
dipolederiv: -0.4487633 -0.3111266 -0.2015138 -0.2246202 -1.0419616 -0.2965837 -0.1684297 -0.233699 -0.3793268 -0.5999538 0.040028 0.3002294 -0.0942542 -0.6043363 -0.1408415 0.2048475 -0.2773627 -0.6922891 -0.5589628 -0.1300055 0.1692194 -0.0475148 -0.6588691 0.2257685 0.1203332 0.1918663 -0.319417 0.2051329 0.0013492 0.0104118 -0.0707648 0.1148491 0.0215293 0.1093787 0.0555644 0.1160674 0.0843092 -0.0774623 0.0018985 -0.0515705 0.4033894 -0.1629492 -0.0102934 -0.1078837 0.1717016 0.041269 0.0530675 -0.0359472 0.0301075 -0.0767818 0.0050427 -0.0369696 -0.0054093 0.0535098 0.0035975 0.0117873 -0.043524 0.0238746 -0.0086491 -0.0612051 -0.0511702 -0.0712946 -0.0581183 0.7496429 0.3235969 -0.2916245 0.4357188 1.1266052 0.4684257 -0.3378438 0.5640219 0.6955735 -0.0774716 -0.0496527 0.0910518 -0.050815 0.0152231 0.0440094 0.0626822 0.0311006 -0.0515122 0.0649352 -0.015608 -0.0130088 -0.0178843 -0.0016732 -0.0692701 -0.001552 -0.0625547 -0.0817829 0.1005295 -0.0323467 -0.043699 -0.0135271 -0.005216 -0.0874408 -0.0200442 -0.1283631 -0.1034055 -0.0002695 -0.0772254 0.1162054 -0.0277133 0.0303434 0.038643 0.1108248 0.0755997 -0.0335906 -0.159053 0.0768611 -0.0736231 0.0313148 0.0588443 0.0183975 -0.0937609 0.0331174 0.0707954 0.0040599 -0.0429521 0.1281778 -0.0629337 0.0532945 0.0508937 0.0847532 0.0204628 -0.0041117 -0.1350167 0.029943 -0.1188821 0.0666141 0.0889847 0.0276688 -0.0956454 0.0082999 0.0332889 0.1071244 0.0437329 0.0138277 0.0136231 -0.1795249 -0.0087585 0.0236034 0.0269083 0.0798605 0.3001747 0.1082272 0.0421433 0.0558261 0.2057669 -0.02461 0.0174102 -0.0915817 0.0756399 0.0971705 0.1170259 -0.1947773 0.0314612 0.1665808 -0.043589 -0.1036747 -0.0496326 0.2090462 0.221545 -0.0692396 0.1434346 -0.0269422 0.3131307 -0.005131 0.1855509 0.02084 0.2180708 unknown
polarizability: 67.9930869|2.2926609|71.8728815|-0.1733653|1.6095104|62.7051257 unknown
InChI: InChI=1S/C5H11NO2/c1-3(2)4(6)5(7)8/h3-4,7H,6H2,1-2H3
charge 0 multiplicity 1
19 atoms
O  -1.516297 -1.514635 -0.559048
O  -1.658442 0.277368 0.909553
N  -0.095934 1.760144 -1.130833
C  1.440976 0.015609 -0.200387
C  0.065925 0.316442 -0.891688
C  1.688414 -1.501763 -0.036704
C  1.610673 0.758931 1.145007
C  -1.099581 -0.265146 -0.071965
H  2.184342 0.423311 -0.914049
H  0.069798 -0.203219 -1.865739
H  1.533026 -2.046974 -0.985742
H  1.013965 -1.946361 0.718578
H  2.726912 -1.682066 0.2961
H  0.844206 0.451554 1.879711
H  2.604105 0.534414 1.57465
H  1.548599 1.854381 1.015237
H  -0.248589 2.294486 -0.267955
H  -0.802813 1.984671 -1.838819
H  -2.260886 -1.858949 0.007692
