program: Orca
programVersion: 5.0.2
elementType: Cl S O O O O O O O C C C C C C C C C C C C C C C C C C C C H H H H H H H H H H H H H H H H H H H H H H H
charge: 0
multiplicity: 1
keywords: wb97x-d3
keywords: def2-TZVPP
keywords: def2/J RIJCOSX
keywords: DEFGRID2
keywords: scfconv7
keywords: smallprint printgap noloewdin
keywords: NOSOSCF
formula: C20H23ClO7S
InChI: InChI=1/C20H23ClO7S/c1-29(25,26)17-8-7-13(20(24)18-15(22)5-2-6-16(18)23)19(21)14(17)11-27-10-12-4-3-9-28-12/h7-8,12,22H,2-6,9-11H2,1H3
52 atoms
Cl 0.684776 -0.533166 2.153681
S  -4.050795 -0.951142 -0.739034
O  0.454761 3.522765 1.080169
O  -2.518079 1.438422 1.471613
O  1.518411 0.615056 -1.29882
O  4.540027 -2.513145 0.449271
O  2.156012 -3.137743 0.235811
O  -4.365174 -1.707893 -1.941309
O  -4.754397 -1.251027 0.497052
C  -0.489787 2.546655 0.662692
C  -1.087288 3.054133 -0.64611
C  0.050669 3.904369 -1.198838
C  0.627637 4.502107 0.076214
C  -1.495181 2.356545 1.789378
C  2.916929 -0.988624 -0.309636
C  5.071951 0.771119 -1.022895
C  3.703987 1.379929 -0.758837
C  5.349099 -0.361748 -0.04927
C  2.605212 0.346398 -0.834875
C  4.216882 -1.331487 0.023185
C  1.884753 -1.985174 -0.099593
C  -1.60874 -0.685785 0.686206
C  -2.306698 0.084928 1.791354
C  0.435772 -1.643437 -0.252658
C  -2.270262 -1.118766 -0.473453
C  -0.24877 -0.984642 0.759637
C  -0.255686 -2.062463 -1.370963
C  -1.607356 -1.799855 -1.482624
C  -4.278967 0.773692 -1.128642
H  0.039212 1.611025 0.469612
H  -1.370448 2.23954 -1.31111
H  -1.975855 3.667086 -0.464384
H  -0.277727 4.662416 -1.910089
H  0.782422 3.264855 -1.694788
H  1.689929 4.745546 -0.009905
H  0.100307 5.426503 0.346055
H  -0.976996 2.060543 2.709817
H  -1.986698 3.313359 1.988634
H  5.115483 0.392801 -2.047109
H  5.850067 1.529792 -0.938699
H  3.476901 2.181774 -1.461175
H  3.672204 1.81797 0.245677
H  5.497776 0.036709 0.961429
H  6.263536 -0.901018 -0.301697
H  -1.741188 -0.010528 2.721241
H  -3.285635 -0.352068 1.970564
H  0.259746 -2.590883 -2.16132
H  -2.150354 -2.139515 -2.352372
H  -5.341825 0.902639 -1.331267
H  -3.703335 1.018411 -2.018376
H  -3.973542 1.392612 -0.29061
H  3.696533 -3.062744 0.464486
totalener: -2161.06859691 hartree
nucrepener: 3477.89720709 hartree
electener: -5638.96580400 hartree
oneelecener: -9885.24553672 hartree
twoeener: 4246.27973272 hartree
kineticenergy: 2154.13542927 hartree
xcener: -162.939280041939 hartree
chargesum: -0.0000000
charge: -0.072672 0.835895 -0.353722 -0.330557 -0.384517 -0.274503 -0.359174 -0.486121 -0.476295 0.221417 -0.153812 -0.160065 0.044537 -0.022985 -0.302942 -0.148128 -0.103646 -0.094557 0.299457 0.266337 0.270782 -0.080245 -0.092076 0.191002 -0.105564 0.029632 -0.083252 -0.085552 -0.313791 0.003223 0.069436 0.078952 0.074332 0.082286 0.060373 0.065735 0.082360 0.084151 0.083500 0.083571 0.088270 0.093156 0.098621 0.100578 0.105910 0.159034 0.116981 0.146540 0.139346 0.118417 0.149864 0.240479
qa: -0.0727 0.8359 -0.3537 -0.3306 -0.3845 -0.2745 -0.3592 -0.4861 -0.4763 0.2214 -0.1538 -0.1601 0.0445 -0.0230 -0.3029 -0.1481 -0.1036 -0.0946 0.2995 0.2663 0.2708 -0.0802 -0.0921 0.1910 -0.1056 0.0296 -0.0833 -0.0856 -0.3138 0.0032 0.0694 0.0790 0.0743 0.0823 0.0604 0.0657 0.0824 0.0842 0.0835 0.0836 0.0883 0.0932 0.0986 0.1006 0.1059 0.1590 0.1170 0.1465 0.1393 0.1184 0.1499 0.2405
va: 1.2692 5.5777 2.0121 1.9444 2.0849 2.2921 2.1533 2.0007 1.9880 3.8702 3.8960 3.9615 3.9644 3.9658 3.4856 3.9292 3.8492 3.9216 3.9055 3.9252 3.8864 3.6106 3.8739 3.5653 3.8705 3.9503 4.0388 3.9542 3.8743 1.0270 1.0211 1.0129 1.0197 1.0261 0.9912 0.9903 1.0137 1.0100 1.0079 1.0132 1.0245 1.0128 1.0088 1.0231 1.0095 1.0121 1.0097 1.0250 1.0194 1.0130 1.0217 1.0991
dispcorr: -0.035582356 hartree
energy: -2161.104179265914
dipole: 8.61428 -5.84566 2.76862 29.30191 -27.66978 1.63213 -9.24648 8.63569 -0.61079
magnitude: 3.27141 au
magnitude: 8.31528 debye
