program: Orca
programVersion: 5.0.2
elementType: Cl S O O O O O O O C C C C C C C C C C C C C C C C C C C C H H H H H H H H H H H H H H H H H H H H H H H
charge: 0
multiplicity: 1
keywords: wb97x-d3
keywords: def2-TZVPP
keywords: def2/J RIJCOSX
keywords: DEFGRID2
keywords: scfconv7
keywords: smallprint printgap noloewdin
keywords: NOSOSCF
formula: C20H23ClO7S
InChI: InChI=1/C20H23ClO7S/c1-29(25,26)17-8-7-13(20(24)18-15(22)5-2-6-16(18)23)19(21)14(17)11-27-10-12-4-3-9-28-12/h7-8,12,22H,2-6,9-11H2,1H3
52 atoms
Cl 0.724454 -0.713413 2.26504
S  -3.897828 -0.801753 -0.839451
O  -1.993859 3.597753 -0.435419
O  -2.325576 1.456191 1.39698
O  1.750812 0.655886 -0.659446
O  4.553573 -2.9560 0.409164
O  2.147438 -3.363699 0.159469
O  -4.212785 -1.582419 -2.027075
O  -4.65977 -1.022565 0.37865
C  -1.407399 3.582632 0.844422
C  -0.118149 4.388164 0.68002
C  0.321371 4.040087 -0.74747
C  -0.970129 3.524161 -1.408512
C  -1.117648 2.171899 1.332089
C  3.04676 -1.212072 -0.062698
C  5.331738 0.439785 -0.616029
C  4.035598 1.121954 -0.20974
C  5.534027 -0.831684 0.189522
C  2.834667 0.212173 -0.346347
C  4.323182 -1.703863 0.1712
C  1.948876 -2.159048 -0.010602
C  -1.507968 -0.709992 0.69836
C  -2.199243 0.108232 1.77179
C  0.527021 -1.733949 -0.184294
C  -2.140411 -1.074749 -0.501465
C  -0.1691 -1.072967 0.819809
C  -0.136938 -2.092233 -1.339467
C  -1.470539 -1.762959 -1.498759
C  -3.998678 0.917052 -1.291996
H  -2.113543 4.058283 1.530936
H  -0.334019 5.453068 0.774694
H  0.63836 4.143266 1.426979
H  1.087759 3.265709 -0.7508
H  0.729159 4.906666 -1.267094
H  -1.278165 4.12802 -2.264356
H  -0.834856 2.495045 -1.761173
H  -0.393043 1.684755 0.665246
H  -0.647826 2.229431 2.324892
H  5.305235 0.198562 -1.681593
H  6.178628 1.110622 -0.469711
H  3.852725 2.024455 -0.793037
H  4.092816 1.430578 0.84112
H  5.743792 -0.586972 1.237605
H  6.38992 -1.407576 -0.166333
H  -1.657795 0.012855 2.716891
H  -3.205649 -0.265353 1.936943
H  0.383994 -2.630218 -2.119919
H  -1.993253 -2.058837 -2.396476
H  -5.049241 1.114229 -1.504313
H  -3.406279 1.081708 -2.188866
H  -3.646877 1.552457 -0.485895
H  3.660365 -3.429773 0.37145
totalener: -2161.07185175 hartree
nucrepener: 3447.71597980 hartree
electener: -5608.78783155 hartree
oneelecener: -9825.07419218 hartree
twoeener: 4216.28636063 hartree
kineticenergy: 2154.12857695 hartree
xcener: -162.937518189664 hartree
chargesum: -0.0000000
charge: -0.077812 0.837499 -0.352915 -0.311849 -0.390796 -0.276516 -0.359020 -0.489020 -0.480997 0.229177 -0.181508 -0.155995 0.018737 -0.058341 -0.313024 -0.148346 -0.111744 -0.101814 0.307482 0.266866 0.282825 -0.083526 -0.060097 0.227209 -0.094276 -0.006236 -0.106194 -0.094848 -0.284018 0.082896 0.082935 0.066455 0.068695 0.074926 0.082356 0.068480 0.067306 0.074369 0.084257 0.083369 0.094547 0.086364 0.097808 0.101824 0.099931 0.158062 0.119520 0.143644 0.128707 0.110456 0.150863 0.241327
qa: -0.0778 0.8375 -0.3529 -0.3118 -0.3908 -0.2765 -0.3590 -0.4890 -0.4810 0.2292 -0.1815 -0.1560 0.0187 -0.0583 -0.3130 -0.1483 -0.1117 -0.1018 0.3075 0.2669 0.2828 -0.0835 -0.0601 0.2272 -0.0943 -0.0062 -0.1062 -0.0948 -0.2840 0.0829 0.0829 0.0665 0.0687 0.0749 0.0824 0.0685 0.0673 0.0744 0.0843 0.0834 0.0945 0.0864 0.0978 0.1018 0.0999 0.1581 0.1195 0.1436 0.1287 0.1105 0.1509 0.2413
va: 1.2635 5.5707 2.0090 1.9717 2.0832 2.2885 2.1584 1.9965 1.9829 3.9598 3.9563 3.8963 3.9346 4.0066 3.5000 3.9259 3.8599 3.9224 3.9009 3.9323 3.8903 3.6598 3.8356 3.4995 3.8922 3.9350 4.0626 3.9610 3.8661 1.0044 1.0094 1.0169 1.0350 1.0138 0.9925 0.9862 0.9651 1.0094 1.0084 1.0137 1.0225 1.0108 1.0089 1.0232 1.0135 1.0115 1.0115 1.0289 1.0214 1.0159 1.0356 1.1022
dispcorr: -0.033980697 hartree
energy: -2161.105832446386
dipole: 12.16723 -8.40017 3.76706 29.45596 -27.94380 1.51216 -7.55130 7.49213 -0.05917
magnitude: 4.05966 au
magnitude: 10.31885 debye
