program: Orca
programVersion: 5.0.2
elementType: Cl S O O O O O O O C C C C C C C C C C C C C C C C C C C C H H H H H H H H H H H H H H H H H H H H H H H
charge: 0
multiplicity: 1
keywords: wb97x-d3
keywords: def2-TZVPP
keywords: def2/J RIJCOSX
keywords: DEFGRID2
keywords: scfconv7
keywords: smallprint printgap noloewdin
keywords: NOSOSCF
formula: C20H23ClO7S
InChI: InChI=1/C20H23ClO7S/c1-29(25,26)17-8-7-13(20(24)18-15(22)5-2-6-16(18)23)19(21)14(17)11-27-10-12-4-3-9-28-12/h7-8,12,22H,2-6,9-11H2,1H3
52 atoms
Cl 0.677175 -0.806663 2.281878
S  -3.944195 -0.853791 -0.82217
O  -1.796014 3.419221 -0.54135
O  -2.322012 1.395419 1.419914
O  1.627066 0.606259 -0.707449
O  4.544483 -2.915608 0.358443
O  2.147918 -3.39943 0.119606
O  -4.267304 -1.626222 -2.012996
O  -4.713493 -1.066784 0.392812
C  -1.302085 3.459582 0.784791
C  0.036216 4.227175 0.733799
C  0.101491 4.737275 -0.705406
C  -0.732917 3.69131 -1.427741
C  -1.088975 2.064623 1.335888
C  2.976539 -1.216364 -0.079738
C  5.038947 0.675033 0.492805
C  3.925128 1.118154 -0.438418
C  5.447272 -0.752462 0.173666
C  2.727474 0.190898 -0.414603
C  4.268296 -1.666935 0.15097
C  1.908857 -2.198968 -0.023868
C  -1.556986 -0.789082 0.718255
C  -2.237097 0.041786 1.789549
C  0.475344 -1.808209 -0.174616
C  -2.192036 -1.150862 -0.480335
C  -0.218618 -1.156294 0.836474
C  -0.193608 -2.170125 -1.325992
C  -1.528109 -1.843145 -1.478943
C  -4.015876 0.86855 -1.268689
H  -2.045518 3.982547 1.395026
H  0.082918 5.026217 1.472719
H  0.873775 3.552373 0.932816
H  1.119625 4.810273 -1.08739
H  -0.361965 5.721552 -0.793085
H  -1.152511 4.037638 -2.373543
H  -0.132442 2.793566 -1.62767
H  -0.382006 1.537273 0.683206
H  -0.619472 2.138581 2.328491
H  5.899775 1.338049 0.402712
H  4.70307 0.735748 1.530875
H  4.293471 1.149052 -1.470708
H  3.576626 2.125176 -0.206575
H  6.175858 -1.139482 0.888141
H  5.928697 -0.800763 -0.810289
H  -1.707301 -0.07349 2.739205
H  -3.255126 -0.303649 1.943663
H  0.326481 -2.703584 -2.11012
H  -2.054809 -2.137497 -2.374796
H  -5.0608 1.080123 -1.494155
H  -3.406181 1.032232 -2.153653
H  -3.66484 1.492009 -0.453631
H  3.671648 -3.422063 0.296721
totalener: -2161.07297897 hartree
nucrepener: 3443.45340601 hartree
electener: -5604.52638498 hartree
oneelecener: -9816.67394606 hartree
twoeener: 4212.14756109 hartree
kineticenergy: 2154.13468212 hartree
xcener: -162.937478368608 hartree
chargesum: -0.0000000
charge: -0.076143 0.835988 -0.347624 -0.318416 -0.394365 -0.277032 -0.359070 -0.489209 -0.481907 0.203915 -0.204097 -0.122715 0.016726 -0.023858 -0.303225 -0.143976 -0.112667 -0.107420 0.300249 0.267721 0.282717 -0.093488 -0.058342 0.223429 -0.080220 -0.002399 -0.103964 -0.100090 -0.279182 0.084191 0.078993 0.072621 0.064790 0.074710 0.079766 0.068863 0.053136 0.076426 0.082092 0.083448 0.089763 0.089845 0.101395 0.097476 0.100071 0.157087 0.119780 0.143297 0.126837 0.113588 0.149432 0.241056
qa: -0.0761 0.8360 -0.3476 -0.3184 -0.3944 -0.2770 -0.3591 -0.4892 -0.4819 0.2039 -0.2041 -0.1227 0.0167 -0.0239 -0.3032 -0.1440 -0.1127 -0.1074 0.3002 0.2677 0.2827 -0.0935 -0.0583 0.2234 -0.0802 -0.0024 -0.1040 -0.1001 -0.2792 0.0842 0.0790 0.0726 0.0648 0.0747 0.0798 0.0689 0.0531 0.0764 0.0821 0.0834 0.0898 0.0898 0.1014 0.0975 0.1001 0.1571 0.1198 0.1433 0.1268 0.1136 0.1494 0.2411
va: 1.2660 5.5712 2.0041 1.9764 2.0741 2.2870 2.1574 1.9962 1.9807 3.9200 3.9383 3.9191 3.9734 3.9892 3.4859 3.9122 3.8852 3.9276 3.8991 3.9172 3.8912 3.6794 3.8336 3.4946 3.9012 3.9295 4.0570 3.9698 3.8698 1.0059 1.0162 1.0134 1.0197 1.0124 0.9972 1.0035 0.9715 1.0047 1.0147 1.0102 1.0125 1.0229 1.0239 1.0097 1.0138 1.0124 1.0113 1.0294 1.0194 1.0161 1.0319 1.1023
dispcorr: -0.033409123 hartree
energy: -2161.106388088403
dipole: 12.24283 -8.52631 3.71652 31.28816 -29.57941 1.70875 -6.48915 6.39662 -0.09253
magnitude: 4.09157 au
magnitude: 10.39994 debye
