program: Orca
programVersion: 5.0.2
elementType: Cl S O O O O O O O C C C C C C C C C C C C C C C C C C C C H H H H H H H H H H H H H H H H H H H H H H H
charge: 0
multiplicity: 1
keywords: wb97x-d3
keywords: def2-TZVPP
keywords: def2/J RIJCOSX
keywords: DEFGRID2
keywords: scfconv7
keywords: smallprint printgap noloewdin
keywords: NOSOSCF
formula: C20H23ClO7S
InChI: InChI=1/C20H23ClO7S/c1-29(25,26)17-8-7-13(20(24)18-15(22)5-2-6-16(18)23)19(21)14(17)11-27-10-12-4-3-9-28-12/h7-8,12,22H,2-6,9-11H2,1H3
52 atoms
Cl 0.670919 -0.803335 2.286856
S  -3.943296 -0.859217 -0.827923
O  -1.80419 3.43251 -0.536452
O  -2.343103 1.383844 1.402278
O  1.62397 0.587462 -0.69709
O  4.534825 -2.935196 0.389475
O  2.14044 -3.417341 0.144423
O  -4.279645 -1.672088 -1.987824
O  -4.72053 -1.003843 0.392044
C  -1.335822 3.463225 0.798857
C  -0.007488 4.249556 0.781979
C  0.077175 4.778466 -0.649288
C  -0.728565 3.729475 -1.399452
C  -1.115406 2.064862 1.337854
C  2.971744 -1.236613 -0.06726
C  5.041084 0.659701 0.469987
C  3.931859 1.082331 -0.476369
C  5.444421 -0.777329 0.19087
C  2.726027 0.16785 -0.417537
C  4.26216 -1.687738 0.170897
C  1.902821 -2.21722 -0.005452
C  -1.563338 -0.800861 0.722623
C  -2.246549 0.035746 1.787472
C  0.469588 -1.827857 -0.16036
C  -2.197895 -1.173585 -0.473237
C  -0.22517 -1.166163 0.843948
C  -0.199914 -2.20405 -1.3068
C  -1.534613 -1.878568 -1.463206
C  -3.977224 0.844675 -1.341434
H  -2.097496 3.968557 1.40132
H  0.014124 5.039415 1.531657
H  0.835464 3.583957 0.988596
H  1.100926 4.871419 -1.011063
H  -0.399293 5.756686 -0.733649
H  -1.134966 4.080811 -2.34911
H  -0.112107 2.842259 -1.59799
H  -0.395711 1.549422 0.688795
H  -0.65842 2.133897 2.33673
H  5.905428 1.315772 0.364877
H  4.702227 0.75082 1.504732
H  4.30045 1.071943 -1.508879
H  3.594435 2.100381 -0.28012
H  6.160006 -1.151208 0.925301
H  5.940957 -0.852514 -0.783742
H  -1.711301 -0.06409 2.735707
H  -3.260599 -0.316695 1.949252
H  0.31907 -2.747676 -2.084638
H  -2.060971 -2.183659 -2.355693
H  -3.360144 0.962137 -2.228531
H  -3.619328 1.491393 -0.547389
H  -5.016345 1.068722 -1.581636
H  3.66059 -3.44019 0.326979
totalener: -2161.07311526 hartree
nucrepener: 3440.02854181 hartree
electener: -5601.10165706 hartree
oneelecener: -9809.84735522 hartree
twoeener: 4208.74569816 hartree
kineticenergy: 2154.13859260 hartree
xcener: -162.938100641538 hartree
chargesum: -0.0000000
charge: -0.076539 0.836995 -0.347645 -0.317557 -0.392768 -0.277575 -0.359003 -0.489048 -0.482464 0.202903 -0.204104 -0.123418 0.018505 -0.021893 -0.304979 -0.144188 -0.113693 -0.106059 0.301933 0.266674 0.283434 -0.096609 -0.055159 0.221353 -0.079866 0.001517 -0.105201 -0.101157 -0.277713 0.083828 0.079048 0.073935 0.065018 0.074620 0.079459 0.067287 0.053876 0.075178 0.082059 0.083474 0.089146 0.090001 0.101235 0.097653 0.099636 0.156946 0.120111 0.142413 0.113139 0.148103 0.126106 0.241052
qa: -0.0765 0.8370 -0.3476 -0.3176 -0.3928 -0.2776 -0.3590 -0.4890 -0.4825 0.2029 -0.2041 -0.1234 0.0185 -0.0219 -0.3050 -0.1442 -0.1137 -0.1061 0.3019 0.2667 0.2834 -0.0966 -0.0552 0.2214 -0.0799 0.0015 -0.1052 -0.1012 -0.2777 0.0838 0.0790 0.0739 0.0650 0.0746 0.0795 0.0673 0.0539 0.0752 0.0821 0.0835 0.0891 0.0900 0.1012 0.0977 0.0996 0.1569 0.1201 0.1424 0.1131 0.1481 0.1261 0.2411
va: 1.2652 5.5703 2.0035 1.9789 2.0763 2.2863 2.1577 1.9963 1.9810 3.9221 3.9363 3.9187 3.9741 3.9868 3.4838 3.9119 3.8820 3.9276 3.9002 3.9195 3.8907 3.6867 3.8399 3.4945 3.9007 3.9203 4.0581 3.9732 3.8687 1.0061 1.0161 1.0131 1.0196 1.0125 0.9972 1.0040 0.9718 1.0047 1.0146 1.0102 1.0122 1.0241 1.0239 1.0100 1.0131 1.0120 1.0114 1.0297 1.0155 1.0334 1.0198 1.1026
dispcorr: -0.033211553 hartree
energy: -2161.106326811743
dipole: 12.29812 -8.56806 3.73006 31.30721 -29.61889 1.68831 -6.60191 6.47832 -0.12358
magnitude: 4.09622 au
magnitude: 10.41175 debye
