program: Orca
programVersion: 5.0.2
elementType: Cl S O O O O O C C C C C C C C C C C C C C H H H H H H H H H H H H H
charge: 0
multiplicity: 1
keywords: wb97x-d3
keywords: def2-TZVPP
keywords: def2/J RIJCOSX
keywords: DEFGRID2
keywords: scfconv7
keywords: smallprint printgap noloewdin
keywords: NOSOSCF
formula: C14H13ClO5S
InChI: InChI=1/C14H13ClO5S/c1-21(19,20)8-5-6-9(10(15)7-8)14(18)13-11(16)3-2-4-12(13)17/h5-7,16H,2-4H2,1H3
34 atoms
Cl 0.573714 0.997488 1.92616
S  -4.32927 0.099022 -0.146016
O  4.252187 -1.76918 0.369184
O  1.194084 1.289045 -1.418642
O  1.822852 -2.345977 0.350571
O  -4.506624 1.499642 0.225855
O  -4.85406 -0.369735 -1.424363
C  2.601254 -0.241801 -0.33056
C  4.56125 1.798297 -0.135102
C  5.045531 0.362848 -0.238443
C  3.425687 2.034338 -1.112536
C  3.918529 -0.591207 -0.06116
C  2.29973 1.040465 -0.97112
C  1.565086 -1.190313 0.001482
C  0.118338 -0.813726 -0.037975
C  -2.588543 -0.269671 -0.100719
C  -0.430806 0.143502 0.809297
C  -0.719775 -1.517032 -0.892859
C  -1.78229 0.430753 0.783563
C  -2.076151 -1.243334 -0.941375
C  -5.002105 -0.916689 1.147077
H  -0.3044 -2.272961 -1.546431
H  4.225482 1.998099 0.885618
H  5.38452 2.482931 -0.338265
H  5.818508 0.137839 0.498307
H  5.489908 0.17974 -1.223985
H  3.797016 1.952751 -2.141026
H  3.008581 3.03804 -1.013985
H  -2.190201 1.187844 1.440415
H  -2.711799 -1.786197 -1.627538
H  -6.078221 -0.741061 1.178445
H  -4.806888 -1.964746 0.928259
H  -4.556985 -0.640788 2.101113
H  3.419522 -2.321843 0.435217
elementType: Cl S O C H
totalener: -1775.97205726 hartree
nucrepener: 2008.61418820 hartree
electener: -3784.58624545 hartree
oneelecener: -6431.19886462 hartree
twoeener: 2646.61261917 hartree
cpcmener: -0.04239064 hartree
kineticenergy: 1770.65458079 hartree
xcener: -126.051079682725 hartree
chargesum: -0.0000000
charge: -0.063204 0.854056 -0.304415 -0.456406 -0.435657 -0.545741 -0.547021 -0.308673 -0.131451 -0.088590 -0.091614 0.313103 0.289459 0.404625 0.070588 0.004153 0.019434 -0.113944 -0.133441 -0.169545 -0.248786 0.149870 0.083191 0.082675 0.099519 0.110620 0.103502 0.090840 0.129186 0.152384 0.139281 0.137242 0.137948 0.266813
qa: -0.0632 0.8541 -0.3044 -0.4564 -0.4357 -0.5457 -0.5470 -0.3087 -0.1315 -0.0886 -0.0916 0.3131 0.2895 0.4046 0.0706 0.0042 0.0194 -0.1139 -0.1334 -0.1695 -0.2488 0.1499 0.0832 0.0827 0.0995 0.1106 0.1035 0.0908 0.1292 0.1524 0.1393 0.1372 0.1379 0.2668
va: 1.2599 5.5577 2.2611 2.0295 2.0736 1.9217 1.9270 3.4532 3.9182 3.9387 3.8766 3.8968 3.9468 3.7901 3.5994 3.7716 3.9979 4.0130 4.1207 4.0457 3.8736 1.0065 1.0119 1.0140 1.0218 1.0072 1.0091 1.0278 1.0316 1.0148 1.0114 1.0067 1.0051 1.0596
dispcorr: -0.018204542 hartree
energy: -1775.990261798105
dipole: 9.50178 -6.56234 2.93944 -0.22646 -0.88968 -1.11614 -3.26654 4.51123 1.24469
magnitude: 3.38162 au
magnitude: 8.59539 debye
