program: Orca
programVersion: 5.0.2
elementType: Cl Cl O O O N N C C C C C C C C C C C C C C C C C C C C H H H H H H H H H H H H H H H H
charge: 0
multiplicity: 1
keywords: wb97x-d3
keywords: def2-TZVPP
keywords: def2/J RIJCOSX
keywords: DEFGRID2
keywords: scfconv7
keywords: smallprint printgap noloewdin
keywords: NOSOSCF
formula: C20H16Cl2N2O3
InChI: InChI=1/C20H16Cl2N2O3/c1-12-18(19(26)15-9-8-14(21)10-16(15)22)20(24(2)23-12)27-11-17(25)13-6-4-3-5-7-13/h3-10H,11H2,1-2H3
43 atoms
Cl 0.433515 0.421345 -1.630947
Cl 5.622166 1.373892 -0.752758
O  -2.717169 -1.778703 1.189735
O  -0.07043 -0.185781 2.267085
O  -2.854976 -0.293586 -1.031469
N  -1.688667 -3.365536 -0.06192
N  -0.496958 -3.751476 -0.558819
C  -0.261443 -1.821463 0.583599
C  -1.599357 -2.234494 0.634159
C  0.365163 -2.832278 -0.205797
C  0.370167 -0.71002 1.254805
C  1.664188 -0.195064 0.708298
C  1.793189 -2.978977 -0.5973
C  -2.886032 -4.130217 -0.319272
C  -2.926468 -0.387704 1.333421
C  -2.842776 0.337041 0.004087
C  1.795457 0.33539 -0.570163
C  2.779103 -0.190493 1.540669
C  -2.747202 1.813107 0.027803
C  3.005788 0.829858 -1.028862
C  4.003775 0.278951 1.102267
C  4.102598 0.782856 -0.184915
C  -2.555224 2.494378 -1.176083
C  -2.824722 2.5391 1.217208
C  -2.431858 3.872066 -1.186779
C  -2.710276 3.91994 1.202107
C  -2.508851 4.587269 0.002572
H  1.958076 -3.974742 -1.00575
H  2.08328 -2.258257 -1.36218
H  2.465368 -2.845577 0.249405
H  -2.652305 -4.870839 -1.076758
H  -3.232323 -4.640802 0.577761
H  -3.678055 -3.484643 -0.692842
H  -3.940513 -0.278409 1.724227
H  -2.244804 0.031377 2.069934
H  2.695253 -0.587775 2.543773
H  3.087196 1.245002 -2.023932
H  4.863989 0.254239 1.756159
H  -2.494913 1.94558 -2.106057
H  -2.979402 2.044043 2.166483
H  -2.273598 4.391162 -2.122453
H  -2.772397 4.47306 2.129341
H  -2.409371 5.664573 -0.006586
elementType: Cl O N C H
totalener: -2027.44379497 hartree
nucrepener: 2807.68891438 hartree
electener: -4835.13270935 hartree
oneelecener: -8363.94414838 hartree
twoeener: 3528.81143903 hartree
cpcmener: -0.03825806 hartree
kineticenergy: 2021.50583454 hartree
xcener: -148.643603866755 hartree
chargesum: 0.0000000
charge: -0.069539 -0.077039 -0.329057 -0.468709 -0.437353 0.121488 -0.336919 -0.222133 0.263705 0.088173 0.394095 0.104019 -0.270754 -0.160783 -0.006692 0.385228 -0.045511 -0.157593 -0.020643 -0.124501 -0.160775 0.102807 -0.164512 -0.162387 -0.160025 -0.166249 -0.115666 0.106230 0.109131 0.114540 0.111793 0.124941 0.114114 0.162038 0.142457 0.149878 0.129028 0.149364 0.145473 0.147031 0.162706 0.163124 0.165478
qa: -0.0695 -0.0770 -0.3291 -0.4687 -0.4374 0.1215 -0.3369 -0.2221 0.2637 0.0882 0.3941 0.1040 -0.2708 -0.1608 -0.0067 0.3852 -0.0455 -0.1576 -0.0206 -0.1245 -0.1608 0.1028 -0.1645 -0.1624 -0.1600 -0.1662 -0.1157 0.1062 0.1091 0.1145 0.1118 0.1249 0.1141 0.1620 0.1425 0.1499 0.1290 0.1494 0.1455 0.1470 0.1627 0.1631 0.1655
va: 1.2510 1.2265 2.1100 1.9978 2.0253 3.3134 2.9305 3.3494 4.1081 3.9661 3.8491 3.3785 3.9863 3.8863 3.8124 3.7691 3.9694 3.9718 3.5678 4.0560 3.9943 3.8785 3.9365 3.9488 3.9365 3.9145 3.8955 1.0192 0.9912 0.9893 1.0100 0.9862 1.0008 0.9885 1.0169 1.0074 1.0183 1.0029 1.0246 1.0061 0.9913 0.9910 0.9865
dispcorr: -0.026398001 hartree
energy: -2027.470192967059
dipole: -19.19325 18.66002 -0.53323 -5.21678 6.27696 1.06018 5.85986 -4.98715 0.87271
magnitude: 1.47307 au
magnitude: 3.74426 debye
