program: Orca
programVersion: 5.0.2
elementType: Cl Cl O O O N N C C C C C C C C C C C C C C C C C C C C H H H H H H H H H H H H H H H H
charge: 0
multiplicity: 1
keywords: wb97x-d3
keywords: def2-TZVPP
keywords: def2/J RIJCOSX
keywords: DEFGRID2
keywords: scfconv7
keywords: smallprint printgap noloewdin
keywords: NOSOSCF
formula: C20H16Cl2N2O3
InChI: InChI=1/C20H16Cl2N2O3/c1-12-18(19(26)15-9-8-14(21)10-16(15)22)20(24(2)23-12)27-11-17(25)13-6-4-3-5-7-13/h3-10H,11H2,1-2H3
43 atoms
Cl 0.569486 0.517492 1.557661
Cl 5.694214 1.382247 0.295038
O  -2.759512 -1.818247 -0.94145
O  -0.183763 -0.318306 -2.243802
O  -2.767429 -0.23868 1.217486
N  -1.680261 -3.337049 0.351716
N  -0.4668 -3.708612 0.804829
C  -0.276558 -1.85453 -0.463974
C  -1.618798 -2.251272 -0.415493
C  0.383861 -2.824059 0.348852
C  0.320231 -0.790873 -1.235314
C  1.651177 -0.261286 -0.805175
C  1.831034 -2.968206 0.662985
C  -2.870795 -4.06629 0.720518
C  -2.98376 -0.434787 -1.13164
C  -2.836472 0.346871 0.157795
C  1.863991 0.351662 0.423924
C  2.711974 -0.32373 -1.703033
C  -2.777929 1.822705 0.068251
C  3.101475 0.868524 0.771511
C  3.963264 0.165556 -1.374693
C  4.14272 0.757897 -0.134673
C  -2.531113 2.557129 1.230289
C  -2.943498 2.496713 -1.142433
C  -2.439537 3.936373 1.178373
C  -2.858343 3.879192 -1.189971
C  -2.600939 4.599621 -0.032435
H  2.179093 -2.199076 1.353115
H  2.007477 -3.934405 1.133043
H  2.451088 -2.90931 -0.230781
H  -2.601217 -4.774662 1.496869
H  -3.627357 -3.389067 1.111388
H  -3.280615 -4.612154 -0.127449
H  -2.344471 -0.042014 -1.919818
H  -4.017785 -0.34747 -1.47425
H  2.563868 -0.7871 -2.669683
H  3.246267 1.35093 1.728178
H  4.780632 0.089926 -2.077876
H  -2.403501 2.049026 2.176529
H  -3.143166 1.959839 -2.060131
H  -2.239792 4.497015 2.081584
H  -2.987184 4.392591 -2.133148
H  -2.524605 5.678186 -0.073034
elementType: Cl O N C H
totalener: -2027.44407209 hartree
nucrepener: 2802.01995922 hartree
electener: -4829.46403130 hartree
oneelecener: -8352.60911939 hartree
twoeener: 3523.14508808 hartree
cpcmener: -0.03843036 hartree
kineticenergy: 2021.50205528 hartree
xcener: -148.642549836303 hartree
chargesum: -0.0000000
charge: -0.070041 -0.077467 -0.331061 -0.470847 -0.438599 0.123182 -0.337403 -0.222251 0.261190 0.088659 0.399718 0.101115 -0.269006 -0.160499 -0.006272 0.391971 -0.046360 -0.156200 -0.023805 -0.125905 -0.161656 0.102899 -0.163369 -0.161371 -0.159621 -0.166506 -0.115683 0.109027 0.106122 0.113670 0.111733 0.113762 0.124746 0.142521 0.162099 0.150234 0.129842 0.149543 0.144566 0.146441 0.162653 0.162874 0.165357
qa: -0.0700 -0.0775 -0.3311 -0.4708 -0.4386 0.1232 -0.3374 -0.2223 0.2612 0.0887 0.3997 0.1011 -0.2690 -0.1605 -0.0063 0.3920 -0.0464 -0.1562 -0.0238 -0.1259 -0.1617 0.1029 -0.1634 -0.1614 -0.1596 -0.1665 -0.1157 0.1090 0.1061 0.1137 0.1117 0.1138 0.1247 0.1425 0.1621 0.1502 0.1298 0.1495 0.1446 0.1464 0.1627 0.1629 0.1654
va: 1.2508 1.2261 2.1087 1.9969 2.0238 3.3129 2.9299 3.3538 4.1108 3.9681 3.8495 3.3823 3.9861 3.8867 3.8145 3.7641 3.9692 3.9701 3.5816 4.0558 3.9949 3.8778 3.9358 3.9496 3.9337 3.9158 3.8948 0.9912 1.0191 0.9896 1.0101 1.0009 0.9863 1.0146 0.9884 1.0071 1.0182 1.0027 1.0253 1.0062 0.9913 0.9911 0.9865
dispcorr: -0.026234144 hartree
energy: -2027.470306231780
dipole: -19.93063 19.29931 -0.63132 -5.41166 6.44018 1.02852 -4.08645 3.21682 -0.86963
magnitude: 1.48751 au
magnitude: 3.78094 debye
