program: Orca
programVersion: 5.0.2
elementType: Cl Cl O O O N N C C C C C C C C C C C C C C C C C C C C H H H H H H H H H H H H H H H H
charge: 0
multiplicity: 1
keywords: wb97x-d3
keywords: def2-TZVPP
keywords: def2/J RIJCOSX
keywords: DEFGRID2
keywords: scfconv7
keywords: smallprint printgap noloewdin
keywords: NOSOSCF
formula: C20H16Cl2N2O3
InChI: InChI=1/C20H16Cl2N2O3/c1-12-18(19(26)15-9-8-14(21)10-16(15)22)20(24(2)23-12)27-11-17(25)13-6-4-3-5-7-13/h3-10H,11H2,1-2H3
43 atoms
Cl 0.659963 0.429858 -1.562522
Cl 5.852683 1.179479 -0.494264
O  -2.646846 -1.683321 1.231215
O  -0.012466 -0.133113 2.290627
O  -2.704448 -0.274138 -1.046293
N  -1.656218 -3.306402 -0.004292
N  -0.472149 -3.728484 -0.491549
C  -0.192599 -1.794552 0.634967
C  -1.541347 -2.170125 0.678353
C  0.412402 -2.829485 -0.140224
C  0.451338 -0.694138 1.30832
C  1.786526 -0.238878 0.812155
C  1.838631 -3.019567 -0.518703
C  -2.874491 -4.038479 -0.26024
C  -2.860478 -0.288256 1.318285
C  -2.791799 0.388313 -0.03473
C  1.984009 0.288815 -0.458432
C  2.868927 -0.282023 1.685079
C  -2.818729 1.868226 -0.06096
C  3.228611 0.735921 -0.871915
C  4.125796 0.141843 1.293838
C  4.29094 0.64456 0.012637
C  -2.570497 2.526197 -1.267469
C  -3.076734 2.619729 1.086606
C  -2.569423 3.909235 -1.320928
C  -3.082484 4.00466 1.027855
C  -2.824767 4.650529 -0.173341
H  1.974959 -4.015403 -0.937958
H  2.160909 -2.299717 -1.27164
H  2.506473 -2.918834 0.336394
H  -3.282088 -4.463028 0.655225
H  -3.620182 -3.392562 -0.719753
H  -2.641091 -4.846163 -0.946155
H  -3.870306 -0.17075 1.719084
H  -2.172999 0.172294 2.027145
H  2.731883 -0.67584 2.68393
H  3.362533 1.149892 -1.862049
H  4.959484 0.082951 1.979642
H  -2.370228 1.957072 -2.165328
H  -3.278497 2.14094 2.036102
H  -2.368208 4.412046 -2.257543
H  -3.285294 4.57856 1.921942
H  -2.82164 5.732013 -0.216028
elementType: Cl O N C H
totalener: -2027.44462940 hartree
nucrepener: 2787.59330017 hartree
electener: -4815.03792957 hartree
oneelecener: -8323.76686567 hartree
twoeener: 3508.72893611 hartree
cpcmener: -0.03870235 hartree
kineticenergy: 2021.48508195 hartree
xcener: -148.639222349209 hartree
chargesum: -0.0000000
charge: -0.070666 -0.077578 -0.331882 -0.473411 -0.437832 0.123702 -0.338796 -0.227535 0.259896 0.091675 0.409430 0.093916 -0.270783 -0.160517 -0.001684 0.391794 -0.043799 -0.154570 -0.018308 -0.126080 -0.162074 0.102412 -0.163846 -0.162701 -0.160987 -0.166371 -0.116989 0.105840 0.109408 0.114373 0.123207 0.115667 0.111412 0.159611 0.143970 0.150131 0.129980 0.149731 0.143622 0.145754 0.162620 0.162998 0.165261
qa: -0.0707 -0.0776 -0.3319 -0.4734 -0.4378 0.1237 -0.3388 -0.2275 0.2599 0.0917 0.4094 0.0939 -0.2708 -0.1605 -0.0017 0.3918 -0.0438 -0.1546 -0.0183 -0.1261 -0.1621 0.1024 -0.1638 -0.1627 -0.1610 -0.1664 -0.1170 0.1058 0.1094 0.1144 0.1232 0.1157 0.1114 0.1596 0.1440 0.1501 0.1300 0.1497 0.1436 0.1458 0.1626 0.1630 0.1653
va: 1.2505 1.2258 2.1113 1.9962 2.0250 3.3116 2.9298 3.3610 4.1125 3.9631 3.8472 3.3874 3.9866 3.8877 3.8143 3.7711 3.9685 3.9715 3.5944 4.0539 3.9962 3.8754 3.9466 3.9500 3.9353 3.9160 3.8951 1.0194 0.9913 0.9891 0.9870 0.9993 1.0104 0.9894 1.0102 1.0070 1.0179 1.0027 1.0245 1.0058 0.9914 0.9912 0.9866
dispcorr: -0.025842060 hartree
energy: -2027.470471455571
dipole: -20.97874 20.23463 -0.74411 -4.61699 5.68107 1.06408 4.98471 -4.15487 0.82984
magnitude: 1.54098 au
magnitude: 3.91685 debye
