program: Orca
programVersion: 5.0.2
elementType: Cl Cl O O O N N C C C C C C C C C C C C C C C C C C C C H H H H H H H H H H H H H H H H
charge: 0
multiplicity: 1
keywords: wb97x-d3
keywords: def2-TZVPP
keywords: def2/J RIJCOSX
keywords: DEFGRID2
keywords: scfconv7
keywords: smallprint printgap noloewdin
keywords: NOSOSCF
formula: C20H16Cl2N2O3
InChI: InChI=1/C20H16Cl2N2O3/c1-12-18(19(26)15-9-8-14(21)10-16(15)22)20(24(2)23-12)27-11-17(25)13-6-4-3-5-7-13/h3-10H,11H2,1-2H3
43 atoms
Cl 0.522722 0.663714 1.405548
Cl 5.695478 1.378072 0.241201
O  -2.738055 -1.839071 -0.955211
O  -0.152358 -0.431446 -2.318582
O  -2.848998 -0.283466 1.225815
N  -1.673005 -3.323812 0.397135
N  -0.46286 -3.676228 0.87489
C  -0.263606 -1.870011 -0.459517
C  -1.604951 -2.266493 -0.407368
C  0.390764 -2.807068 0.394765
C  0.339315 -0.845875 -1.279134
C  1.665178 -0.295948 -0.858689
C  1.835288 -2.935389 0.726428
C  -2.867169 -4.036154 0.787844
C  -2.949993 -0.450729 -1.132224
C  -2.83645 0.313358 0.169755
C  1.849768 0.402563 0.328231
C  2.750859 -0.437504 -1.716469
C  -2.762779 1.791107 0.110345
C  3.083158 0.92903 0.675144
C  3.99852 0.06075 -1.386787
C  4.149135 0.740277 -0.18849
C  -3.018689 2.515885 1.277216
C  -2.416915 2.477771 -1.054774
C  -2.937143 3.896588 1.27606
C  -2.325348 3.861337 -1.049117
C  -2.585849 4.572259 0.11295
H  2.0045 -3.863982 1.269251
H  2.458706 -2.949233 -0.167065
H  2.185474 -2.116893 1.355878
H  -3.282994 -4.599847 -0.045246
H  -2.599288 -4.727138 1.580158
H  -3.618383 -3.344867 1.164479
H  -2.3007 -0.058405 -1.910901
H  -3.977429 -0.346832 -1.489844
H  2.624838 -0.969364 -2.6505
H  3.205677 1.478877 1.597942
H  4.834927 -0.076821 -2.057407
H  -3.293981 1.999557 2.187174
H  -2.193321 1.95312 -1.973182
H  -3.14466 4.448711 2.182823
H  -2.042996 4.382317 -1.954016
H  -2.51269 5.651815 0.11509
elementType: Cl O N C H
totalener: -2027.44374757 hartree
nucrepener: 2804.84751305 hartree
electener: -4832.29126062 hartree
oneelecener: -8358.13402519 hartree
twoeener: 3525.84276456 hartree
cpcmener: -0.03783567 hartree
kineticenergy: 2021.49498626 hartree
xcener: -148.640344285990 hartree
chargesum: 0.0000000
charge: -0.069075 -0.077521 -0.333440 -0.466890 -0.443567 0.123794 -0.336745 -0.212527 0.251490 0.092319 0.386271 0.104642 -0.269610 -0.158985 0.011148 0.392829 -0.041952 -0.156473 -0.036980 -0.132971 -0.161743 0.106502 -0.145543 -0.167716 -0.160675 -0.164700 -0.117631 0.105955 0.113470 0.109811 0.125023 0.111892 0.112459 0.141088 0.154667 0.150709 0.129405 0.149733 0.143413 0.146383 0.162605 0.163653 0.165482
qa: -0.0691 -0.0775 -0.3334 -0.4669 -0.4436 0.1238 -0.3367 -0.2125 0.2515 0.0923 0.3863 0.1046 -0.2696 -0.1590 0.0111 0.3928 -0.0420 -0.1565 -0.0370 -0.1330 -0.1617 0.1065 -0.1455 -0.1677 -0.1607 -0.1647 -0.1176 0.1060 0.1135 0.1098 0.1250 0.1119 0.1125 0.1411 0.1547 0.1507 0.1294 0.1497 0.1434 0.1464 0.1626 0.1637 0.1655
va: 1.2541 1.2258 2.1000 1.9995 2.0107 3.3161 2.9307 3.3493 4.1204 3.9673 3.8641 3.3959 3.9865 3.8849 3.8116 3.7505 3.9638 3.9622 3.5503 4.0631 3.9953 3.8754 3.9400 3.9455 3.9212 3.9238 3.8908 1.0189 0.9893 0.9896 0.9863 1.0101 1.0026 1.0230 0.9912 1.0065 1.0187 1.0027 1.0240 1.0117 0.9910 0.9907 0.9867
dispcorr: -0.026529457 hartree
energy: -2027.470277027026
dipole: -19.64525 19.13721 -0.50804 -5.69307 6.74445 1.05138 -2.93388 2.16827 -0.76561
magnitude: 1.39630 au
magnitude: 3.54912 debye
