program: Gaussian 09
title: 000059492
version: EM64L-G09RevD.01
frameworkgroup: C1[X(C18H25NO3)]
method: RPBEPBE
basis: SDD
operation: Freq
keyword: #p
keyword: freq=noraman
keyword: PBEPBE/SDD
title: #p freq=noraman PBEPBE/SDD
converged: YES YES NO NO
title: Mulliken charges:
elementType: O O O N C C C C C C C C C C C C C C C C C C H H H H H H H H H H H H H H H H H H H H H H H H H
charge: -0.490433 -0.272844 -0.263817 -0.053546 -0.195450 -0.520767 -0.495233 0.211141 -0.616140 0.183441 0.045787 -0.438099 -0.416723 0.470703 -0.396081 -0.401259 -0.419527 -0.392034 -0.617335 -0.230194 -0.229008 -0.245606 0.260864 0.243959 0.232331 0.232812 0.251550 0.217110 0.239120 0.236729 0.374751 0.208062 0.222729 0.218319 0.232181 0.179798 0.222290 0.183259 0.222025 0.225730 0.269281 0.189332 0.225255 0.226172 0.221308 0.222821 0.225238
chargesum: 0.00000
title: Mulliken charges with hydrogens summed into heavy atoms:
elementType: O O O N C C C C C C C C C C C C C C C C C C
charge: -0.115682 -0.272844 -0.263817 -0.053546 0.065413 -0.044476 -0.010872 0.211141 -0.159910 0.183441 0.282515 -0.007308 0.033777 0.470703 0.006007 0.004025 -0.193797 -0.122753 0.023424 -0.008886 -0.006187 -0.020369
polarizability: 2.22265130e+02 -7.48125802e+00 2.23404661e+02 -1.65571118e+01 -5.08751164e+00 1.62481504e+02
1716.lowfreq: -29.2949 -9.9383 -1.5721 -0.0007 -0.0006 0.0005 3.8193 18.8975 35.1360
frequency: -26.1573 18.8335 35.1271 45.8449 51.5225 76.6320 80.1522 84.9742 111.4850 146.0896 161.6948 188.2679 208.3692 230.2392 243.0759 249.6363 256.8952 293.8873 305.3820 334.0326 348.6384 356.7600 367.7977 395.3983 404.4366 436.5373 439.6110 458.5337 480.8409 489.8180 541.3933 589.5825 599.6571 618.1125 624.9381 696.6448 706.8039 742.4804 750.7192 780.0922 792.0049 804.6877 818.9651 824.7451 840.0607 855.5605 872.0656 881.5492 914.4552 916.5422 922.4972 927.0547 976.0477 981.1947 990.2291 992.4890 999.7202 1003.4497 1015.5611 1028.0068 1031.9178 1049.3808 1051.5700 1067.6228 1080.7801 1083.0044 1089.0619 1107.2899 1122.6873 1127.1454 1132.6039 1141.7342 1147.4000 1166.3431 1170.0165 1171.4160 1188.0002 1204.1127 1205.9846 1218.5241 1244.1961 1260.9651 1270.2748 1276.0977 1296.2104 1306.1360 1308.5773 1331.4714 1336.6540 1342.0402 1353.5291 1357.2955 1372.4756 1377.0185 1382.9526 1424.7431 1432.5034 1440.2190 1451.5531 1455.7622 1459.8268 1463.1104 1463.7445 1465.8548 1479.8565 1482.5393 1483.1182 1591.2245 1596.8979 1614.1231 2819.5993 2830.3759 2861.5743 3005.5170 3006.2394 3009.0034 3016.4976 3020.7189 3032.5778 3037.7955 3068.1546 3073.8621 3078.7298 3081.8702 3098.9536 3105.9719 3112.9663 3123.9809 3129.4598 3136.6006 3151.9599 3164.6364 3201.3807 3218.8671 3436.0539
redmass: 2.9479 4.8538 3.7940 4.3544 3.6608 5.0407 4.4782 4.7127 3.2600 4.6389 3.2490 4.3627 1.3687 2.0599 2.3384 3.0695 5.0639 3.6383 4.2264 2.6393 2.4008 2.3665 3.4391 3.2179 2.7951 2.2569 1.4638 2.4175 3.2394 2.9675 4.5724 4.4656 2.9874 6.2092 3.1357 5.4615 1.8006 3.3483 2.1319 1.8555 1.7091 3.6744 1.4575 1.2759 2.5431 1.2460 3.2525 3.0916 2.6331 3.2536 1.8177 1.8706 1.3934 1.4306 5.9040 1.3851 2.0758 2.3073 3.2395 2.2286 2.3704 1.8858 1.7417 1.6904 1.4286 1.4871 1.5415 1.1417 1.9562 1.7245 1.9790 1.3598 2.1725 2.1287 1.3804 1.0799 1.1245 1.8942 1.6764 2.3132 1.7644 1.3867 1.8650 1.3966 1.5163 1.2112 1.3813 1.2824 1.3734 1.5129 1.5022 1.5753 1.6722 1.5047 6.1566 1.0894 1.1733 2.0182 1.0918 1.1900 1.3293 1.0607 1.0700 1.0959 1.1028 1.0548 2.3104 6.0729 10.5514 6.1428 1.0717 1.0694 1.0573 1.0597 1.0605 1.0659 1.0806 1.0728 1.0856 1.0871 1.1022 1.1036 1.1010 1.1039 1.0509 1.0608 1.0860 1.0870 1.0901 1.0930 1.0959 1.0998 1.1168 1.1152 1.0648
irintensity: 0.5077 0.1749 0.0148 0.0825 0.5125 0.4762 0.3316 0.6676 0.7239 1.3796 0.0303 0.9620 0.4751 4.6532 3.9283 0.4359 5.3149 7.4858 6.5244 11.7415 9.6661 12.5820 12.2702 0.8434 2.7999 26.4966 72.0182 17.1433 2.6650 0.7074 12.6638 18.8910 4.3655 0.3361 7.6006 8.4276 54.8747 15.5343 25.7848 4.9715 2.2974 6.9958 0.5958 14.0728 7.0023 1.0441 7.0003 18.5806 14.9326 19.3020 3.8516 9.3824 3.2310 5.1425 0.5464 5.1367 7.3534 81.9995 54.3657 7.3955 18.8222 5.1612 51.7321 23.6746 16.5146 3.3598 14.3122 5.8763 87.3163 69.2623 12.6409 1.6150 4.0579 250.4138 5.7117 11.6721 1.3053 24.4756 14.7477 13.5733 57.3166 3.3196 23.2526 16.1281 10.5797 3.6595 0.9482 1.3143 1.1467 3.6971 12.3217 2.2124 30.7601 4.6892 1.1904 9.7960 2.7610 6.3145 7.9922 11.5319 4.1046 18.0792 4.7206 13.1410 11.9556 8.1305 19.7579 2.3522 114.7564 7.9523 50.6060 89.5349 191.6582 19.0389 18.3781 6.9486 17.0418 45.3399 59.2102 26.3132 9.2653 18.6972 33.7293 32.2810 19.6999 15.0518 8.7907 1.4704 6.8437 36.6927 29.9922 13.9921 0.3896 16.7362 55.9856
temp: 298.150 k
press: 1.00000 atm
elementType: 8 8 8 7 6 6 6 6 6 6 6 6 6 6 6 6 6 6 6 6 6 6 1 1 1 1 1 1 1 1 1 1 1 1 1 1 1 1 1 1 1 1 1 1 1 1 1
symmnumber: 1
zpe: 1039607.1 jmol-1
zpe.correction: 0.395965 hartree
zpe.thermalcorrener: 0.416881 hartree
zpe.thermalcorrenthalpy: 0.417825 hartree
zpe.thermalcorrgfe: 0.345243 hartree
zpe.sumelectzpe: -979.622116 hartree
zpe.sumelectthermal: -979.601201 hartree
zpe.sumelectthermalent: -979.600257 hartree
zpe.sumelectthermalfe: -979.672839 hartree
dipole: 3.3083 -0.9930 -0.8383
dipole: 3.5544
quadrupole: -125.5839 -126.8423 -133.3055
quadrupole: -1.8616 0.7030 -2.0444
quadrupole: 2.9933 1.7349 -4.7283 -1.8616 0.7030 -2.0444
hfenergy: -980.0180816 hartree
pointgroup: C01 [X(C18H25N1O3)]
dipole: -1.1976119 -0.6675884 0.2748806 debye
polarizability: 220.5022779|6.5413581|226.5244323|-14.7384867|1.9899888|161.1245848 unknown
InChI: InChI=1S/C18H25NO3/c1-19-11-9-16(10-12-19)22-17(20)18(21,15-7-8-15)13-14-5-3-2-4-6-14/h2-6,15-16,21H,7-13H2,1H3
charge 0 multiplicity 1
47 atoms
O  2.115683 2.19132 -0.906649
O  -0.809531 0.391272 0.365639
O  0.048505 0.726297 -1.777785
N  -4.733955 -1.224796 0.001166
C  0.551167 2.968893 0.816675
C  0.19396 4.212232 -0.004191
C  1.367798 4.254064 0.988483
C  1.198981 1.746445 0.14464
C  1.988856 0.907447 1.200808
C  0.097186 0.903958 -0.532235
C  -1.940795 -0.433176 -0.195948
C  -2.426535 -1.341265 0.93697
C  -3.063847 0.488911 -0.694803
C  2.553239 -0.403096 0.6764
C  -3.6612 -2.138407 0.460126
C  -4.276755 -0.367717 -1.118678
C  1.979421 -1.642053 1.063531
C  3.659164 -0.416685 -0.214369
C  -5.983893 -1.942877 -0.315499
C  2.493875 -2.865117 0.57577
C  4.173231 -1.637189 -0.705858
C  3.593324 -2.866427 -0.313047
H  -0.134109 2.697018 1.626723
H  0.456862 4.205181 -1.0655
H  -0.72784 4.744993 0.246079
H  1.252486 4.818612 1.918337
H  2.369566 4.263619 0.55066
H  1.314252 0.717427 2.054837
H  2.799436 1.57213 1.553224
H  -1.52913 -1.021898 -1.038604
H  1.783558 1.808828 -1.767192
H  -1.622085 -2.034011 1.245203
H  -2.707988 -0.721047 1.807117
H  -3.365972 1.167156 0.123962
H  -2.712868 1.094795 -1.548814
H  -3.353097 -2.84994 -0.352854
H  -4.051445 -2.747609 1.295874
H  -4.001456 -0.981139 -2.018242
H  -5.109519 0.294608 -1.417918
H  1.128265 -1.644337 1.756417
H  4.104684 0.535918 -0.51917
H  -5.879082 -2.66655 -1.163654
H  -6.325637 -2.504948 0.572026
H  -6.7720 -1.21659 -0.58304
H  2.042874 -3.813164 0.891442
H  5.027944 -1.63086 -1.392188
H  3.996323 -3.812927 -0.691169
