program: Orca
programVersion: 5.0.2
elementType: Cl Cl O O O N N C C C C C C C C C C C C C C C C C C C C H H H H H H H H H H H H H H H H
charge: 0
multiplicity: 1
keywords: wb97x-d3
keywords: def2-TZVPP
keywords: def2/J RIJCOSX
keywords: DEFGRID2
keywords: scfconv7
keywords: smallprint printgap noloewdin
keywords: NOSOSCF
formula: C20H16Cl2N2O3
InChI: InChI=1/C20H16Cl2N2O3/c1-12-18(19(26)15-9-8-14(21)10-16(15)22)20(24(2)23-12)27-11-17(25)13-6-4-3-5-7-13/h3-10H,11H2,1-2H3
43 atoms
Cl 2.22458 -2.426803 -0.806793
Cl 3.701493 2.389568 -2.575349
O  -0.985352 -1.229087 -1.139312
O  1.190771 -0.721665 2.733121
O  -3.090279 -0.187742 0.203295
N  -1.65708 -3.021483 0.100254
N  -1.485238 -3.642317 1.283944
C  -0.187837 -1.801149 1.185883
C  -0.915269 -1.921495 -0.001862
C  -0.626548 -2.917087 1.955848
C  0.867133 -0.891259 1.566714
C  1.600336 -0.127239 0.511383
C  -0.200381 -3.323411 3.318721
C  -2.611639 -3.5121 -0.866651
C  -1.154312 0.177425 -1.113694
C  -2.300306 0.622775 -0.232369
C  2.20588 -0.71061 -0.597964
C  1.706456 1.254222 0.667471
C  -2.405809 2.066373 0.079192
C  2.860053 0.055967 -1.549384
C  2.338514 2.042845 -0.275904
C  2.90504 1.42983 -1.38232
C  -3.3793 2.485788 0.988531
C  -1.557157 3.013384 -0.497185
C  -3.49473 3.823835 1.32057
C  -1.681425 4.35416 -0.168863
C  -2.645357 4.760223 0.743159
H  -0.654664 -4.277267 3.581849
H  0.882229 -3.434057 3.385801
H  -0.498176 -2.589789 4.067248
H  -2.124149 -3.773392 -1.803404
H  -3.074799 -4.402446 -0.454448
H  -3.384445 -2.770139 -1.058784
H  -0.231279 0.678854 -0.828666
H  -1.369137 0.471176 -2.144014
H  1.249717 1.727039 1.526791
H  3.331568 -0.414072 -2.401223
H  2.386813 3.115008 -0.1479
H  -4.043631 1.763789 1.444355
H  -0.795732 2.72472 -1.209366
H  -4.246724 4.138707 2.031394
H  -1.021527 5.080932 -0.62283
H  -2.736219 5.806251 1.004573
elementType: Cl O N C H
totalener: -2027.44241207 hartree
nucrepener: 2815.05288377 hartree
electener: -4842.49529584 hartree
oneelecener: -8376.92671364 hartree
twoeener: 3534.43141780 hartree
cpcmener: -0.04451265 hartree
kineticenergy: 2021.48907489 hartree
xcener: -148.640149270969 hartree
chargesum: -0.0000000
charge: -0.060891 -0.073410 -0.345551 -0.473498 -0.442314 0.150797 -0.340989 -0.190135 0.194936 0.087087 0.405007 0.071131 -0.263912 -0.158455 0.088616 0.378457 -0.014418 -0.127937 -0.002017 -0.118658 -0.198677 0.123780 -0.149787 -0.196280 -0.160549 -0.158073 -0.121150 0.096428 0.104961 0.101576 0.123514 0.111439 0.112795 0.069146 0.165621 0.148127 0.127134 0.150084 0.144150 0.151631 0.162669 0.162400 0.165214
qa: -0.0609 -0.0734 -0.3456 -0.4735 -0.4423 0.1508 -0.3410 -0.1901 0.1949 0.0871 0.4050 0.0711 -0.2639 -0.1585 0.0886 0.3785 -0.0144 -0.1279 -0.0020 -0.1187 -0.1987 0.1238 -0.1498 -0.1963 -0.1605 -0.1581 -0.1211 0.0964 0.1050 0.1016 0.1235 0.1114 0.1128 0.0691 0.1656 0.1481 0.1271 0.1501 0.1442 0.1516 0.1627 0.1624 0.1652
va: 1.2560 1.2307 2.0714 2.0115 2.0285 3.3032 2.9377 3.4275 4.1080 3.9918 3.8714 3.3932 3.9522 3.8869 3.8296 3.8430 3.9592 3.9194 3.5877 4.0429 3.9918 3.8660 3.9615 3.9552 3.9195 3.9168 3.9003 1.0163 0.9965 0.9998 0.9880 1.0106 1.0024 1.0408 0.9913 1.0106 1.0203 1.0042 1.0238 0.9966 0.9914 0.9915 0.9867
dispcorr: -0.026698092 hartree
energy: -2027.469110161043
dipole: -23.31157 22.86282 -0.44875 3.41387 -0.65284 2.76103 10.47343 -12.76079 -2.28736
magnitude: 3.61340 au
magnitude: 9.18454 debye
