program: Orca
programVersion: 5.0.2
elementType: Cl Cl O O O N N C C C C C C C C C C C C C C C C C C C C H H H H H H H H H H H H H H H H
charge: 0
multiplicity: 1
keywords: wb97x-d3
keywords: def2-TZVPP
keywords: def2/J RIJCOSX
keywords: DEFGRID2
keywords: scfconv7
keywords: smallprint printgap noloewdin
keywords: NOSOSCF
formula: C20H16Cl2N2O3
InChI: InChI=1/C20H16Cl2N2O3/c1-12-18(19(26)15-9-8-14(21)10-16(15)22)20(24(2)23-12)27-11-17(25)13-6-4-3-5-7-13/h3-10H,11H2,1-2H3
43 atoms
Cl 0.311703 0.589914 -1.42549
Cl 5.558095 1.473551 -0.88856
O  -2.598884 -1.825395 1.368393
O  0.128729 -0.446346 2.416326
O  -3.049694 -0.373721 -0.844085
N  -1.706924 -3.331246 -0.092608
N  -0.564111 -3.683431 -0.712854
C  -0.207611 -1.868871 0.575124
C  -1.542472 -2.26764 0.690497
C  0.339715 -2.808591 -0.347735
C  0.484775 -0.838498 1.31489
C  1.731738 -0.260502 0.72624
C  1.731913 -2.929448 -0.85844
C  -2.940488 -4.039458 -0.340854
C  -2.789622 -0.428874 1.50658
C  -2.849769 0.270693 0.16374
C  1.758465 0.39669 -0.498975
C  2.911015 -0.333914 1.460845
C  -2.710078 1.743193 0.131409
C  2.928271 0.940777 -1.003313
C  4.096426 0.186484 0.97404
C  4.090629 0.815886 -0.260646
C  -3.185252 2.431776 -0.987949
C  -2.076859 2.454376 1.151315
C  -3.040909 3.804343 -1.077861
C  -1.923039 3.828989 1.051736
C  -2.405327 4.505245 -0.059166
H  2.464763 -2.901293 -0.052543
H  1.847938 -3.874426 -1.386998
H  1.982016 -2.12923 -1.555595
H  -3.263308 -4.595274 0.537524
H  -3.726485 -3.346918 -0.635553
H  -2.767743 -4.737553 -1.15296
H  -3.76356 -0.302994 1.985836
H  -2.049864 -0.000349 2.178196
H  2.907386 -0.829906 2.422784
H  2.929653 1.455321 -1.954212
H  5.007437 0.102631 1.549841
H  -3.678925 1.892506 -1.785731
H  -1.672763 1.95228 2.018993
H  -3.419781 4.329681 -1.944346
H  -1.420339 4.369527 1.842437
H  -2.285402 5.57807 -0.133883
elementType: Cl O N C H
totalener: -2027.44334922 hartree
nucrepener: 2816.67090142 hartree
electener: -4844.11425064 hartree
oneelecener: -8381.65037062 hartree
twoeener: 3537.53611998 hartree
cpcmener: -0.03750043 hartree
kineticenergy: 2021.49574979 hartree
xcener: -148.640608878332 hartree
chargesum: 0.0000000
charge: -0.066862 -0.076368 -0.333816 -0.464795 -0.443246 0.123702 -0.335936 -0.198577 0.243201 0.091078 0.376441 0.101793 -0.268784 -0.158846 0.018683 0.385607 -0.041499 -0.155015 -0.038435 -0.126384 -0.161728 0.104864 -0.142630 -0.167726 -0.162393 -0.162074 -0.116968 0.114037 0.106361 0.108996 0.125276 0.111731 0.111873 0.151164 0.139120 0.150249 0.128978 0.149277 0.142564 0.145815 0.163017 0.163249 0.165003
qa: -0.0669 -0.0764 -0.3338 -0.4648 -0.4432 0.1237 -0.3359 -0.1986 0.2432 0.0911 0.3764 0.1018 -0.2688 -0.1588 0.0187 0.3856 -0.0415 -0.1550 -0.0384 -0.1264 -0.1617 0.1049 -0.1426 -0.1677 -0.1624 -0.1621 -0.1170 0.1140 0.1064 0.1090 0.1253 0.1117 0.1119 0.1512 0.1391 0.1502 0.1290 0.1493 0.1426 0.1458 0.1630 0.1632 0.1650
va: 1.2546 1.2272 2.0945 1.9998 2.0100 3.3180 2.9315 3.3254 4.1309 3.9713 3.8605 3.3876 3.9832 3.8842 3.8093 3.7619 3.9653 3.9654 3.5327 4.0585 3.9973 3.8802 3.9439 3.9264 3.9243 3.9225 3.8884 0.9897 1.0187 0.9909 0.9863 1.0040 1.0101 0.9925 1.0210 1.0074 1.0190 1.0030 1.0229 1.0132 0.9906 0.9906 0.9867
dispcorr: -0.026962653 hartree
energy: -2027.470311873643
dipole: -18.50623 18.24573 -0.26050 -5.59945 6.78407 1.18462 4.73019 -4.05197 0.67822
magnitude: 1.38967 au
magnitude: 3.53225 debye
