program: Orca
programVersion: 5.0.2
elementType: Cl Cl O O O N N C C C C C C C C C C C C C C C C C C C C H H H H H H H H H H H H H H H H
charge: 0
multiplicity: 1
keywords: wb97x-d3
keywords: def2-TZVPP
keywords: def2/J RIJCOSX
keywords: DEFGRID2
keywords: scfconv7
keywords: smallprint printgap noloewdin
keywords: NOSOSCF
formula: C20H16Cl2N2O3
InChI: InChI=1/C20H16Cl2N2O3/c1-12-18(19(26)15-9-8-14(21)10-16(15)22)20(24(2)23-12)27-11-17(25)13-6-4-3-5-7-13/h3-10H,11H2,1-2H3
43 atoms
Cl 2.448652 -2.170305 -0.96598
Cl 3.088484 3.035607 -2.03072
O  -0.932403 -1.45083 -1.250935
O  1.259491 -1.247487 2.691346
O  -2.655587 -0.215341 0.48956
N  -1.638702 -3.267191 -0.100349
N  -1.467491 -3.975033 1.032997
C  -0.140291 -2.151287 1.055059
C  -0.879759 -2.173738 -0.134668
C  -0.589316 -3.316252 1.745025
C  0.863421 -1.236227 1.53455
C  1.439547 -0.209565 0.613488
C  -0.174711 -3.825722 3.076795
C  -2.599288 -3.679126 -1.097635
C  -1.099625 -0.04507 -1.292901
C  -1.984314 0.517497 -0.204793
C  2.159048 -0.521837 -0.534391
C  1.293165 1.131217 0.958553
C  -1.977628 1.987011 -0.022826
C  2.683558 0.468545 -1.349443
C  1.791719 2.13978 0.154102
C  2.475474 1.79362 -1.000414
C  -1.424511 2.845902 -0.973525
C  -2.521786 2.518695 1.147042
C  -1.417827 4.214114 -0.756381
C  -2.498664 3.884817 1.368032
C  -1.949033 4.734361 0.415717
H  0.904964 -3.957599 3.142595
H  -0.467594 -3.144346 3.875606
H  -0.645755 -4.788543 3.266978
H  -3.131072 -4.541688 -0.710106
H  -3.315991 -2.883869 -1.292698
H  -2.110041 -3.958153 -2.028669
H  -0.134494 0.457437 -1.309754
H  -1.572764 0.164681 -2.256526
H  0.749297 1.393912 1.856618
H  3.241805 0.20966 -2.238506
H  1.642174 3.176143 0.422191
H  -0.998128 2.463955 -1.891786
H  -2.947624 1.863286 1.895229
H  -0.992707 4.873582 -1.500798
H  -2.908782 4.288813 2.283712
H  -1.932893 5.802241 0.588754
elementType: Cl O N C H
totalener: -2027.44077914 hartree
nucrepener: 2857.48491563 hartree
electener: -4884.92569478 hartree
oneelecener: -8461.80731010 hartree
twoeener: 3576.88161532 hartree
cpcmener: -0.04517427 hartree
kineticenergy: 2021.49215030 hartree
xcener: -148.643382493970 hartree
chargesum: -0.0000000
charge: -0.062565 -0.074851 -0.348840 -0.478285 -0.433469 0.144990 -0.342600 -0.220773 0.236164 0.081850 0.414506 0.042658 -0.263288 -0.162364 0.074984 0.370574 0.025179 -0.124509 -0.003643 -0.137940 -0.223706 0.144698 -0.178033 -0.154761 -0.165556 -0.159480 -0.110535 0.102335 0.101351 0.095958 0.112255 0.117599 0.122927 0.090057 0.165665 0.151722 0.126004 0.146818 0.145059 0.143070 0.161315 0.162530 0.164931
qa: -0.0626 -0.0749 -0.3488 -0.4783 -0.4335 0.1450 -0.3426 -0.2208 0.2362 0.0819 0.4145 0.0427 -0.2633 -0.1624 0.0750 0.3706 0.0252 -0.1245 -0.0036 -0.1379 -0.2237 0.1447 -0.1780 -0.1548 -0.1656 -0.1595 -0.1105 0.1023 0.1014 0.0960 0.1123 0.1176 0.1229 0.0901 0.1657 0.1517 0.1260 0.1468 0.1451 0.1431 0.1613 0.1625 0.1649
va: 1.2563 1.2297 2.0814 2.0108 2.0279 3.2991 2.9367 3.4553 4.0802 3.9983 3.8545 3.4157 3.9570 3.8890 3.8542 3.7937 3.9109 3.9214 3.5681 4.0592 4.0068 3.8218 3.9122 3.9536 3.8934 3.9262 3.8888 0.9972 0.9991 1.0163 1.0103 0.9971 0.9880 1.0048 0.9896 1.0061 1.0217 1.0079 1.0037 1.0237 0.9924 0.9910 0.9864
dispcorr: -0.028726133 hartree
energy: -2027.469505274987
dipole: -21.87869 21.04857 -0.83013 0.30009 2.54273 2.84283 7.95716 -10.57874 -2.62158
magnitude: 3.95518 au
magnitude: 10.05328 debye
