program: Orca
programVersion: 5.0.2
elementType: Cl Cl O O O N N C C C C C C C C C C C C C C C C C C C C H H H H H H H H H H H H H H H H
charge: 0
multiplicity: 1
keywords: wb97x-d3
keywords: def2-TZVPP
keywords: def2/J RIJCOSX
keywords: DEFGRID2
keywords: scfconv7
keywords: smallprint printgap noloewdin
keywords: NOSOSCF
formula: C20H16Cl2N2O3
InChI: InChI=1/C20H16Cl2N2O3/c1-12-18(19(26)15-9-8-14(21)10-16(15)22)20(24(2)23-12)27-11-17(25)13-6-4-3-5-7-13/h3-10H,11H2,1-2H3
43 atoms
Cl 0.693176 0.602981 -1.398696
Cl 5.962361 1.02372 -0.553957
O  -2.539315 -1.637218 1.347925
O  0.155029 -0.268571 2.40118
O  -2.741146 -0.29593 -0.967799
N  -1.655563 -3.234352 -0.010946
N  -0.507292 -3.652946 -0.580163
C  -0.126208 -1.793582 0.635377
C  -1.479523 -2.137123 0.719495
C  0.41584 -2.794672 -0.22481
C  0.570314 -0.760813 1.362029
C  1.900431 -0.310584 0.848926
C  1.815065 -2.992056 -0.690027
C  -2.905881 -3.911452 -0.263394
C  -2.739412 -0.237763 1.40341
C  -2.79878 0.39197 0.028826
C  2.061313 0.312003 -0.38295
C  3.019819 -0.473695 1.657775
C  -2.905821 1.867389 -0.037972
C  3.304523 0.734228 -0.824502
C  4.275712 -0.075826 1.235875
C  4.403217 0.520468 -0.008491
C  -2.684529 2.504146 -1.260475
C  -3.212239 2.633919 1.087213
C  -2.756647 3.88306 -1.351501
C  -3.297388 4.013465 0.989141
C  -3.064916 4.639541 -0.22747
H  2.128144 -2.212803 -1.385387
H  2.524642 -2.996154 0.136781
H  1.895652 -3.946074 -1.20862
H  -2.712872 -4.719005 -0.961604
H  -3.319813 -4.330938 0.651165
H  -3.629859 -3.229654 -0.705745
H  -3.698728 -0.100251 1.906367
H  -1.982306 0.254033 2.013918
H  2.912126 -0.942126 2.627395
H  3.410665 1.221838 -1.783705
H  5.137486 -0.227389 1.870321
H  -2.442866 1.923374 -2.140492
H  -3.395309 2.169848 2.047444
H  -2.571706 4.370352 -2.299352
H  -3.542413 4.599155 1.864551
H  -3.122826 5.71746 -0.300567
elementType: Cl O N C H
totalener: -2027.44523362 hartree
nucrepener: 2777.93079868 hartree
electener: -4805.37603230 hartree
oneelecener: -8304.29362975 hartree
twoeener: 3498.91759745 hartree
cpcmener: -0.03930933 hartree
kineticenergy: 2021.49989671 hartree
xcener: -148.641407182741 hartree
chargesum: 0.0000000
charge: -0.071329 -0.077353 -0.336333 -0.473554 -0.438761 0.126377 -0.339255 -0.229025 0.253568 0.093410 0.414968 0.085683 -0.270951 -0.159333 0.008838 0.386880 -0.035728 -0.152902 -0.015274 -0.129048 -0.162152 0.104266 -0.162615 -0.164632 -0.162858 -0.168515 -0.114890 0.109829 0.114094 0.105924 0.111240 0.123422 0.114260 0.155885 0.145550 0.150435 0.128889 0.149671 0.143810 0.147130 0.162455 0.162976 0.164947
qa: -0.0713 -0.0774 -0.3363 -0.4736 -0.4388 0.1264 -0.3393 -0.2290 0.2536 0.0934 0.4150 0.0857 -0.2710 -0.1593 0.0088 0.3869 -0.0357 -0.1529 -0.0153 -0.1290 -0.1622 0.1043 -0.1626 -0.1646 -0.1629 -0.1685 -0.1149 0.1098 0.1141 0.1059 0.1112 0.1234 0.1143 0.1559 0.1456 0.1504 0.1289 0.1497 0.1438 0.1471 0.1625 0.1630 0.1649
va: 1.2526 1.2259 2.1045 1.9965 2.0238 3.3137 2.9274 3.3667 4.1180 3.9682 3.8550 3.3959 3.9868 3.8883 3.8152 3.7747 3.9653 3.9706 3.6053 4.0565 3.9979 3.8735 3.9432 3.9539 3.9360 3.9181 3.8923 0.9904 0.9890 1.0196 1.0106 0.9871 1.0003 0.9912 1.0020 1.0067 1.0185 1.0027 1.0237 1.0044 0.9916 0.9913 0.9868
dispcorr: -0.025697429 hartree
energy: -2027.470931052608
dipole: -21.78804 21.03795 -0.75009 -4.41958 5.55402 1.13444 4.05634 -3.36045 0.69589
magnitude: 1.52769 au
magnitude: 3.88309 debye
