program: Orca
programVersion: 5.0.2
elementType: Cl Cl O O O N N C C C C C C C C C C C C C C C C C C C C H H H H H H H H H H H H H H H H
charge: 0
multiplicity: 1
keywords: wb97x-d3
keywords: def2-TZVPP
keywords: def2/J RIJCOSX
keywords: DEFGRID2
keywords: scfconv7
keywords: smallprint printgap noloewdin
keywords: NOSOSCF
formula: C20H16Cl2N2O3
InChI: InChI=1/C20H16Cl2N2O3/c1-12-18(19(26)15-9-8-14(21)10-16(15)22)20(24(2)23-12)27-11-17(25)13-6-4-3-5-7-13/h3-10H,11H2,1-2H3
43 atoms
Cl 2.420116 -2.302861 -0.846769
Cl 3.239032 2.770829 -2.331345
O  -0.939939 -1.43843 -1.149232
O  1.282135 -1.032566 2.74599
O  -2.729018 -0.193231 0.495568
N  -1.63256 -3.207192 0.088358
N  -1.447832 -3.861126 1.251865
C  -0.11998 -2.039923 1.171848
C  -0.872452 -2.11828 -0.006275
C  -0.560808 -3.169879 1.92149
C  0.899609 -1.110569 1.587197
C  1.509039 -0.184909 0.584784
C  -0.119416 -3.620227 3.26577
C  -2.619889 -3.65176 -0.867797
C  -1.103706 -0.03374 -1.223175
C  -2.03944 0.537917 -0.182691
C  2.19526 -0.615872 -0.545224
C  1.417182 1.184069 0.821942
C  -2.0731 2.01084 -0.033833
C  2.742883 0.285542 -1.444099
C  1.937224 2.105311 -0.0691
C  2.590891 1.640979 -1.199472
C  -2.743103 2.557932 1.062046
C  -1.451143 2.861491 -0.949375
C  -2.777986 3.929175 1.245163
C  -1.501147 4.234717 -0.770937
C  -2.158781 4.769738 0.328148
H  -0.39963 -2.906784 4.040657
H  -0.5810 -4.576595 3.505644
H  0.962401 -3.744063 3.314822
H  -3.125458 -4.514452 -0.446885
H  -3.354899 -2.870519 -1.053451
H  -2.157887 -3.941276 -1.809309
H  -0.141173 0.472871 -1.199511
H  -1.531242 0.159645 -2.210854
H  0.895966 1.537635 1.702018
H  3.278305 -0.06402 -2.316066
H  1.828045 3.164817 0.115119
H  -3.223737 1.910722 1.783555
H  -0.930646 2.470375 -1.813735
H  -3.288091 4.344438 2.103899
H  -1.022378 4.886604 -1.489036
H  -2.190377 5.842003 0.470164
elementType: Cl O N C H
totalener: -2027.44147420 hartree
nucrepener: 2844.08825181 hartree
electener: -4871.52972601 hartree
oneelecener: -8434.99115730 hartree
twoeener: 3563.46143129 hartree
cpcmener: -0.04503494 hartree
kineticenergy: 2021.48924585 hartree
xcener: -148.642223366635 hartree
chargesum: 0.0000000
charge: -0.061652 -0.074829 -0.348359 -0.476989 -0.436679 0.145735 -0.342044 -0.217958 0.231847 0.083097 0.405932 0.056482 -0.264056 -0.160598 0.084608 0.380796 0.019941 -0.130535 -0.005737 -0.136232 -0.216762 0.144043 -0.152735 -0.191454 -0.161903 -0.156246 -0.114115 0.100969 0.096195 0.103443 0.111587 0.116250 0.122816 0.076985 0.166981 0.151049 0.127109 0.144707 0.143482 0.144759 0.162998 0.161864 0.165211
qa: -0.0617 -0.0748 -0.3484 -0.4770 -0.4367 0.1457 -0.3420 -0.2180 0.2318 0.0831 0.4059 0.0565 -0.2641 -0.1606 0.0846 0.3808 0.0199 -0.1305 -0.0057 -0.1362 -0.2168 0.1440 -0.1527 -0.1915 -0.1619 -0.1562 -0.1141 0.1010 0.0962 0.1034 0.1116 0.1162 0.1228 0.0770 0.1670 0.1510 0.1271 0.1447 0.1435 0.1448 0.1630 0.1619 0.1652
va: 1.2566 1.2289 2.0795 2.0111 2.0267 3.2992 2.9370 3.4472 4.0856 3.9970 3.8678 3.3883 3.9552 3.8887 3.8570 3.7925 3.9165 3.9189 3.5642 4.0618 4.0089 3.8228 3.9617 3.9246 3.9267 3.8935 3.8942 0.9996 1.0163 0.9967 1.0106 0.9984 0.9882 1.0138 0.9891 1.0062 1.0209 1.0091 1.0236 1.0031 0.9911 0.9917 0.9863
dispcorr: -0.028056831 hartree
energy: -2027.469531030835
dipole: -22.37712 21.58332 -0.79381 1.57253 1.18526 2.75779 8.68864 -11.35308 -2.66444
magnitude: 3.91597 au
magnitude: 9.95360 debye
