program: Gaussian 09
title: 000059496
version: EM64L-G09RevD.01
frameworkgroup: C1[X(C14H27N2O)]
method: RPBEPBE
basis: SDD
operation: Freq
keyword: #p
keyword: freq=noraman
keyword: PBEPBE/SDD
title: #p freq=noraman PBEPBE/SDD
converged: YES YES NO NO
title: Mulliken charges:
elementType: O N N C C C C C C C C C C C C C C H H H H H H H H H H H H H H H H H H H H H H H H H H H
charge: -0.268182 -0.403141 -0.106853 -0.169942 -0.117918 -0.022446 -0.507178 -0.540597 -0.470174 -0.456903 0.228318 -0.499879 -0.296646 -0.287747 -0.571984 -0.692871 -0.700943 0.248574 0.253794 0.270628 0.250672 0.205172 0.217330 0.239830 0.219096 0.242425 0.246187 0.215301 0.312056 0.294922 0.268112 0.309895 0.240738 0.256622 0.258762 0.327400 0.248619 0.250093 0.272707 0.242931 0.231901 0.270747 0.245837 0.244732
chargesum: 1.00000
title: Mulliken charges with hydrogens summed into heavy atoms:
elementType: O N N C C C C C C C C C C C C C C
charge: -0.268182 -0.091085 -0.106853 0.078632 0.135876 0.248182 -0.051334 -0.083437 -0.008653 0.004585 0.228318 0.063155 0.253987 0.227637 0.254127 0.054669 0.060372
polarizability: 1.98810462e+02 1.97945691e+00 1.43943426e+02 -2.68858267e+00 3.62300663e+00 1.39748353e+02
1716.lowfreq: -11.1731 -4.9568 -0.0005 -0.0002 0.0005 6.1203 16.4121 32.4109 48.1504
frequency: 8.3897 32.3286 47.8912 58.9023 63.3952 98.5382 120.4668 152.0167 186.7117 197.3382 224.1939 243.2030 261.0640 271.6465 280.5687 306.2093 337.8646 342.6017 364.2294 392.0593 417.3655 431.1932 453.0851 481.7456 519.0084 558.6431 599.6022 603.3142 673.5825 716.1317 756.0716 759.2767 787.8757 791.9378 799.1919 829.3179 843.8360 856.1726 879.6093 884.0168 901.9852 924.5517 936.3110 940.5696 954.3305 963.5839 965.8644 988.5322 1011.3765 1020.4756 1026.1528 1029.0645 1052.6079 1072.6295 1085.3573 1108.2882 1109.6606 1112.5627 1135.0870 1145.8075 1154.4740 1165.4073 1172.8790 1204.0794 1207.4556 1214.0837 1227.3957 1246.9621 1267.3314 1269.9550 1280.7207 1283.6352 1291.0953 1300.1670 1310.6321 1315.9693 1326.5961 1344.5545 1361.1162 1369.8124 1375.5657 1410.9121 1415.7144 1425.1019 1446.2824 1458.9480 1460.9780 1466.8925 1470.6605 1473.6525 1475.7154 1478.0440 1482.3916 1484.7445 1485.4497 1489.4215 1495.9415 1505.7525 1620.2202 2980.5113 3000.6284 3002.9964 3007.1443 3007.5735 3020.6240 3022.3080 3028.3771 3030.9617 3038.2811 3052.0084 3061.8079 3069.1910 3072.5966 3079.5368 3084.1334 3088.4934 3091.1202 3093.2117 3095.9953 3097.5606 3099.2597 3119.2518 3122.9636 3143.2782 3149.8379 3517.7000
redmass: 3.0859 4.0385 2.6032 3.0203 3.0519 2.4649 2.5077 2.4266 2.5687 2.6799 1.4285 1.2747 1.5827 1.8857 2.8177 2.1241 2.7981 2.3392 2.2865 2.4184 2.3986 2.7660 1.9666 2.5614 2.8821 2.3161 1.8871 2.4837 3.8539 3.5526 3.7354 3.4397 1.5604 1.1854 1.4842 2.4439 2.2465 2.2287 2.2164 2.4049 2.6605 2.8266 2.6268 2.1587 2.0691 2.5058 1.6659 1.8982 1.7704 1.8613 2.0552 2.0673 1.7131 1.9147 2.1863 2.0485 1.1071 1.3898 1.1060 1.6463 1.6951 1.7175 1.7444 1.7183 1.7864 1.3257 1.8177 1.4373 1.3750 1.5085 1.2762 1.4303 1.1489 1.5255 1.4280 1.6135 1.2271 1.3047 1.3233 1.3117 1.2664 1.1983 1.1984 1.1820 1.0787 1.0683 1.1602 1.0636 1.1130 1.0949 1.1335 1.0571 1.0464 1.1618 1.1301 1.1672 1.1415 1.0560 6.4132 1.0673 1.0629 1.0377 1.0375 1.0592 1.0627 1.0331 1.0583 1.0608 1.0618 1.0886 1.1030 1.0915 1.0965 1.1001 1.0965 1.1010 1.1026 1.1010 1.0994 1.1007 1.1017 1.1037 1.1050 1.1058 1.1044 1.0778
irintensity: 0.0434 2.1256 0.7852 1.2495 1.1026 3.7765 2.4357 5.7999 0.5707 5.1014 1.7221 0.6541 1.4229 1.4723 13.0187 0.0433 8.9045 3.3818 0.4471 4.2974 0.3117 4.6249 0.8563 3.8642 3.7661 35.1261 34.6859 7.3984 0.4473 3.7363 6.1021 2.2666 32.4491 7.5783 4.1393 10.5689 16.3906 11.4848 2.4012 2.9793 2.5063 5.9449 13.2695 2.8449 3.9301 5.7100 0.8829 3.5640 24.0685 6.3125 29.0675 3.9119 1.4173 2.0562 12.4171 1.0658 0.6251 12.4365 1.7279 3.5767 3.4329 3.5730 8.1180 4.3713 0.4438 4.8165 20.7196 9.7724 1.9607 7.1588 6.3211 1.5228 4.2938 9.6982 3.2391 3.9208 0.4822 6.5440 6.4346 7.3733 5.4877 32.9903 16.3877 70.7571 11.6688 2.5117 35.0973 14.8070 36.7758 64.1124 15.5227 7.1154 52.1709 26.7497 123.4762 52.1046 14.1023 31.9794 188.2637 38.3573 51.0969 5.0664 4.0082 22.8340 44.3166 18.9360 2.9617 5.5342 21.3504 0.9418 5.6629 53.2606 10.2899 29.1505 17.1001 60.4471 4.2259 1.7152 2.6994 23.4565 3.7802 27.0017 5.2297 3.6436 10.5845 36.7809
temp: 298.150 k
press: 1.00000 atm
elementType: 8 7 7 6 6 6 6 6 6 6 6 6 6 6 6 6 6 1 1 1 1 1 1 1 1 1 1 1 1 1 1 1 1 1 1 1 1 1 1 1 1 1 1 1
symmnumber: 1
zpe: 1043918.0 jmol-1
zpe.correction: 0.397607 hartree
zpe.thermalcorrener: 0.415960 hartree
zpe.thermalcorrenthalpy: 0.416904 hartree
zpe.thermalcorrgfe: 0.349443 hartree
zpe.sumelectzpe: -732.810802 hartree
zpe.sumelectthermal: -732.792450 hartree
zpe.sumelectthermalent: -732.791506 hartree
zpe.sumelectthermalfe: -732.858967 hartree
dipole: -9.8539 -1.1592 -2.7233
dipole: 10.2888
quadrupole: -38.4548 -91.8188 -99.5961
quadrupole: -0.4200 0.8583 -0.6327
quadrupole: 38.1684 -15.1956 -22.9728 -0.4200 0.8583 -0.6327
hfenergy: -733.2084098 hartree
pointgroup: C01 [X(C14H27N2O1)]
dipole: 3.8788766 0.0145129 -1.1574816 debye
polarizability: 198.7694151|3.2238208|140.6711213|1.8022571|-3.9924477|143.0617043 unknown
InChI: InChI=1S/C14H27N2O/c1-4-16(3,5-2)10-14(17)15-13-9-11-6-7-12(13)8-11/h11-13,15H,4-10H2,1-3H3
charge 1 multiplicity 1
44 atoms
O  0.554449 0.261768 1.611201
N  -0.553361 0.593214 -0.410161
N  3.100988 -0.077003 0.2432
C  -2.552694 -0.835346 0.258758
C  -4.038815 0.322045 -1.032383
C  -1.919603 0.594595 0.179015
C  -3.19904 -0.983596 -1.148904
C  -2.931083 1.377625 -0.733043
C  -3.808988 -0.719212 1.175036
C  -4.839135 0.065226 0.279955
C  0.571201 0.444396 0.351878
C  1.897134 0.583256 -0.442179
C  2.788867 -1.541603 0.693533
C  4.300051 -0.114128 -0.74766
C  3.492973 0.714835 1.497288
C  2.186146 -2.443464 -0.388641
C  4.732642 1.238641 -1.324805
H  -1.835917 -1.609761 0.57585
H  -4.666903 0.58015 -1.899073
H  -1.819457 1.028182 1.188371
H  -3.819748 -1.890888 -1.242541
H  -2.47289 -0.967193 -1.984161
H  -2.446121 1.71294 -1.671993
H  -3.326884 2.277366 -0.233281
H  -3.583015 -0.200496 2.123928
H  -4.186302 -1.723887 1.433189
H  -5.737111 -0.543696 0.076662
H  -5.177424 1.006693 0.747374
H  -0.477963 0.710003 -1.424659
H  2.14025 1.654054 -0.549942
H  1.809338 0.143151 -1.44984
H  2.101184 -1.444173 1.547197
H  3.754109 -1.939834 1.052128
H  4.0100 -0.803194 -1.557922
H  5.127003 -0.576774 -0.181274
H  2.625237 0.722098 2.172482
H  4.356421 0.217827 1.965971
H  3.760231 1.742082 1.210946
H  2.038604 -3.441082 0.061421
H  1.19258 -2.099979 -0.72292
H  2.838352 -2.585662 -1.266758
H  5.607116 1.056915 -1.974267
H  3.96058 1.706695 -1.957611
H  5.053298 1.958913 -0.554169
