program: Orca
programVersion: 5.0.2
elementType: Cl Cl O O O N N C C C C C C C C C C C C C C C C C C C C H H H H H H H H H H H H H H H H
charge: 0
multiplicity: 1
keywords: wb97x-d3
keywords: def2-TZVPP
keywords: def2/J RIJCOSX
keywords: DEFGRID2
keywords: scfconv7
keywords: smallprint printgap noloewdin
keywords: NOSOSCF
formula: C20H16Cl2N2O3
InChI: InChI=1/C20H16Cl2N2O3/c1-12-18(19(26)15-9-8-14(21)10-16(15)22)20(24(2)23-12)27-11-17(25)13-6-4-3-5-7-13/h3-10H,11H2,1-2H3
43 atoms
Cl 1.558962 -1.122156 -2.461327
Cl 4.712298 2.654236 -0.373506
O  -0.608811 0.152913 -0.243547
O  1.927499 -3.245544 0.905052
O  -1.68543 1.081713 2.893925
N  -2.061368 -1.640515 -0.479131
N  -2.098229 -2.981257 -0.381706
C  -0.040149 -2.240473 0.137441
C  -0.858184 -1.154729 -0.174609
C  -0.903052 -3.361588 -0.000951
C  1.374372 -2.2672 0.435043
C  2.191441 -1.036761 0.179287
C  -0.595264 -4.801445 0.192306
C  -3.255183 -0.923818 -0.86149
C  -0.33097 0.836469 0.978201
C  -1.592136 1.280927 1.702585
C  2.321665 -0.438108 -1.068692
C  2.895046 -0.487366 1.247347
C  -2.666184 1.966001 0.947501
C  3.100018 0.693545 -1.251044
C  3.667494 0.650192 1.096887
C  3.756171 1.23271 -0.157087
C  -2.420335 2.627695 -0.255432
C  -3.95702 1.964077 1.478458
C  -3.452062 3.280849 -0.911859
C  -4.988762 2.597978 0.809077
C  -4.736418 3.260534 -0.385939
H  0.253515 -5.116872 -0.414739
H  -0.349108 -5.022888 1.231122
H  -1.456853 -5.405946 -0.087696
H  -2.996487 0.010568 -1.350048
H  -3.811279 -1.541314 -1.561837
H  -3.881351 -0.71671 0.00513
H  0.251424 0.219249 1.662859
H  0.269687 1.710545 0.716192
H  2.816994 -0.946031 2.224948
H  3.197497 1.139359 -2.231318
H  4.190562 1.071222 1.944301
H  -1.426867 2.659007 -0.683301
H  -4.157478 1.449456 2.409467
H  -3.253259 3.803911 -1.837894
H  -5.98983 2.578571 1.219486
H  -5.542015 3.762143 -0.906517
elementType: Cl O N C H
totalener: -2027.44923084 hartree
nucrepener: 2782.95256177 hartree
electener: -4810.40179261 hartree
oneelecener: -8311.89024160 hartree
twoeener: 3501.48844898 hartree
cpcmener: -0.03578164 hartree
kineticenergy: 2021.49863611 hartree
xcener: -148.632385689430 hartree
chargesum: -0.0000000
charge: -0.064162 -0.076030 -0.351618 -0.434348 -0.399990 0.145945 -0.327318 -0.225083 0.268223 0.071639 0.399713 -0.006096 -0.259903 -0.186208 0.085968 0.328053 0.037073 -0.128851 0.000973 -0.144770 -0.178439 0.109336 -0.198137 -0.172606 -0.147563 -0.144722 -0.123625 0.103513 0.102687 0.096116 0.125038 0.127846 0.128761 0.116262 0.134260 0.151681 0.125567 0.147037 0.142699 0.139545 0.160297 0.159943 0.161295
qa: -0.0642 -0.0760 -0.3516 -0.4343 -0.4000 0.1459 -0.3273 -0.2251 0.2682 0.0716 0.3997 -0.0061 -0.2599 -0.1862 0.0860 0.3281 0.0371 -0.1289 0.0010 -0.1448 -0.1784 0.1093 -0.1981 -0.1726 -0.1476 -0.1447 -0.1236 0.1035 0.1027 0.0961 0.1250 0.1278 0.1288 0.1163 0.1343 0.1517 0.1256 0.1470 0.1427 0.1395 0.1603 0.1599 0.1613
va: 1.2545 1.2271 2.0178 2.0592 2.0811 3.3194 2.9252 3.4665 4.0732 4.0319 3.8918 3.4774 3.9548 3.8995 3.6258 3.9669 3.9235 3.9427 3.4740 4.0636 4.0186 3.8707 3.9337 3.9591 3.9050 3.9115 3.9071 0.9971 0.9987 1.0159 0.9900 1.0078 0.9834 1.0301 0.9893 1.0070 1.0210 1.0043 1.0104 1.0226 0.9908 0.9911 0.9880
dispcorr: -0.026747893 hartree
energy: -2027.475978733937
dipole: -29.28929 27.84858 -1.44071 -2.47438 5.05505 2.58067 6.15968 -7.16220 -1.00252
magnitude: 3.12099 au
magnitude: 7.93292 debye
