program: Orca
programVersion: 5.0.2
elementType: Cl Cl O O O N N C C C C C C C C C C C C C C C C C C C C H H H H H H H H H H H H H H H H
charge: 0
multiplicity: 1
keywords: wb97x-d3
keywords: def2-TZVPP
keywords: def2/J RIJCOSX
keywords: DEFGRID2
keywords: scfconv7
keywords: smallprint printgap noloewdin
keywords: NOSOSCF
formula: C20H16Cl2N2O3
InChI: InChI=1/C20H16Cl2N2O3/c1-12-18(19(26)15-9-8-14(21)10-16(15)22)20(24(2)23-12)27-11-17(25)13-6-4-3-5-7-13/h3-10H,11H2,1-2H3
43 atoms
Cl 2.369053 -0.665425 -2.659054
Cl 2.461123 3.662729 0.479562
O  -1.468476 -0.789408 0.232175
O  2.29619 -2.913156 -0.510775
O  -0.763574 1.681089 -2.064374
N  -2.043825 -2.978628 0.716509
N  -1.507946 -4.206776 0.826311
C  0.078466 -2.736412 0.205428
C  -1.135897 -2.072125 0.359107
C  -0.240225 -4.088618 0.509343
C  1.371567 -2.201193 -0.166144
C  1.576012 -0.721344 -0.061453
C  0.659194 -5.270556 0.519166
C  -3.438926 -2.748883 1.010646
C  -1.59646 -0.294694 -1.102423
C  -1.35553 1.200311 -1.123391
C  2.09733 0.038252 -1.104144
C  1.317335 -0.083394 1.148102
C  -1.86424 2.046867 -0.018581
C  2.36242 1.390008 -0.952787
C  1.585104 1.261095 1.331219
C  2.114658 1.982132 0.274065
C  -1.245071 3.277393 0.205757
C  -2.961007 1.679846 0.761436
C  -1.695038 4.114226 1.21137
C  -3.427858 2.534359 1.748472
C  -2.789358 3.744028 1.983529
H  1.529796 -5.106817 1.154616
H  0.125363 -6.143523 0.891939
H  1.029013 -5.500231 -0.480396
H  -3.55739 -2.180093 1.931659
H  -3.924447 -2.218079 0.194276
H  -3.91708 -3.716219 1.129348
H  -0.880002 -0.772078 -1.774287
H  -2.602942 -0.503311 -1.484528
H  0.915059 -0.654162 1.975446
H  2.753905 1.968541 -1.778113
H  1.3840 1.73293 2.282814
H  -0.403519 3.577606 -0.403814
H  -3.481258 0.746494 0.591451
H  -1.19687 5.058191 1.389667
H  -4.28911 2.251221 2.339239
H  -3.146869 4.400866 2.766144
elementType: Cl O N C H
totalener: -2027.44970401 hartree
nucrepener: 2844.80440067 hartree
electener: -4872.25410468 hartree
oneelecener: -8436.41030623 hartree
twoeener: 3564.15620155 hartree
cpcmener: -0.03910950 hartree
kineticenergy: 2021.49595478 hartree
xcener: -148.631664651336 hartree
chargesum: 0.0000000
charge: -0.064425 -0.078566 -0.356773 -0.420300 -0.396782 0.132980 -0.335939 -0.190757 0.292159 0.087424 0.323978 0.013282 -0.259565 -0.177786 0.015787 0.316499 0.096788 -0.140194 -0.005450 -0.191808 -0.198821 0.155010 -0.146924 -0.169649 -0.156997 -0.169213 -0.117378 0.103610 0.097078 0.101663 0.127655 0.120515 0.119480 0.128605 0.153017 0.158397 0.123062 0.143093 0.140079 0.151823 0.156245 0.158289 0.160810
qa: -0.0644 -0.0786 -0.3568 -0.4203 -0.3968 0.1330 -0.3359 -0.1908 0.2922 0.0874 0.3240 0.0133 -0.2596 -0.1778 0.0158 0.3165 0.0968 -0.1402 -0.0054 -0.1918 -0.1988 0.1550 -0.1469 -0.1696 -0.1570 -0.1692 -0.1174 0.1036 0.0971 0.1017 0.1277 0.1205 0.1195 0.1286 0.1530 0.1584 0.1231 0.1431 0.1401 0.1518 0.1562 0.1583 0.1608
va: 1.2492 1.2250 2.0191 2.0660 2.0722 3.3249 2.9342 3.5047 4.0652 3.9930 3.9702 3.4598 3.9547 3.8928 3.7575 3.9547 3.9010 3.9126 3.4563 4.0822 4.0040 3.7763 3.9201 3.9656 3.9341 3.9224 3.9089 0.9969 1.0152 0.9996 0.9864 0.9892 1.0114 1.0125 0.9900 0.9923 1.0247 1.0086 1.0233 1.0020 0.9959 0.9922 0.9877
dispcorr: -0.028828430 hartree
energy: -2027.478532440863
dipole: -24.93484 21.71845 -3.21639 -10.80102 11.75000 0.94898 13.00436 -11.14018 1.86418
magnitude: 3.83678 au
magnitude: 9.75233 debye
