program: Orca
programVersion: 5.0.2
elementType: Cl Cl O O O N N C C C C C C C C C C C C C C C C C C C C H H H H H H H H H H H H H H H H
charge: 0
multiplicity: 1
keywords: wb97x-d3
keywords: def2-TZVPP
keywords: def2/J RIJCOSX
keywords: DEFGRID2
keywords: scfconv7
keywords: smallprint printgap noloewdin
keywords: NOSOSCF
formula: C20H16Cl2N2O3
InChI: InChI=1/C20H16Cl2N2O3/c1-12-18(19(26)15-9-8-14(21)10-16(15)22)20(24(2)23-12)27-11-17(25)13-6-4-3-5-7-13/h3-10H,11H2,1-2H3
43 atoms
Cl 1.92579 -0.591946 -2.879407
Cl 2.366612 3.744916 0.213123
O  -1.503103 -0.882075 0.446323
O  2.233538 -2.81022 -0.740089
O  -1.211803 1.355614 -2.181184
N  -1.874102 -3.077464 1.100785
N  -1.246461 -4.262473 1.192829
C  0.141001 -2.734674 0.297987
C  -1.081614 -2.136396 0.587624
C  -0.044277 -4.086273 0.697471
C  1.334244 -2.140704 -0.267371
C  1.48456 -0.652453 -0.200057
C  0.925847 -5.20863 0.634155
C  -3.216224 -2.920473 1.608332
C  -1.865513 -0.476788 -0.875066
C  -1.587348 0.998224 -1.086168
C  1.842782 0.113736 -1.304952
C  1.375632 -0.014642 1.032709
C  -1.811116 1.974468 0.005667
C  2.099258 1.470756 -1.192124
C  1.645592 1.334105 1.177297
C  2.013356 2.061621 0.0575
C  -2.651733 1.7159 1.08926
C  -1.188249 3.220422 -0.093097
C  -2.857115 2.68692 2.057309
C  -1.378295 4.179136 0.885913
C  -2.214277 3.913404 1.963401
H  1.163806 -5.473965 -0.396272
H  1.864985 -4.954548 1.126235
H  0.512134 -6.089167 1.123516
H  -3.71071 -3.886617 1.569276
H  -3.205187 -2.566203 2.63865
H  -3.775648 -2.218709 0.994855
H  -1.307273 -1.04008 -1.626013
H  -2.932878 -0.663918 -1.040762
H  1.099561 -0.590458 1.907081
H  2.364628 2.053258 -2.06377
H  1.569253 1.805801 2.14707
H  -3.173937 0.773691 1.180642
H  -0.546519 3.43658 -0.936679
H  -3.519806 2.483144 2.888096
H  -0.879323 5.135988 0.807217
H  -2.367756 4.664142 2.728011
elementType: Cl O N C H
totalener: -2027.44930828 hartree
nucrepener: 2857.03282669 hartree
electener: -4884.48213496 hartree
oneelecener: -8460.95261085 hartree
twoeener: 3576.47047588 hartree
cpcmener: -0.03902618 hartree
kineticenergy: 2021.49980785 hartree
xcener: -148.633424698741 hartree
chargesum: 0.0000000
charge: -0.063960 -0.077437 -0.356382 -0.418059 -0.396539 0.126411 -0.331421 -0.193197 0.286082 0.088414 0.316817 0.048796 -0.258945 -0.169804 0.020314 0.310058 0.072006 -0.182051 -0.005033 -0.155544 -0.162877 0.123547 -0.168357 -0.146677 -0.164043 -0.153521 -0.119920 0.101333 0.104831 0.096287 0.120135 0.127259 0.116306 0.127562 0.149727 0.158293 0.123021 0.142408 0.147954 0.142315 0.158183 0.155061 0.160647
qa: -0.0640 -0.0774 -0.3564 -0.4181 -0.3965 0.1264 -0.3314 -0.1932 0.2861 0.0884 0.3168 0.0488 -0.2589 -0.1698 0.0203 0.3101 0.0720 -0.1821 -0.0050 -0.1555 -0.1629 0.1235 -0.1684 -0.1467 -0.1640 -0.1535 -0.1199 0.1013 0.1048 0.0963 0.1201 0.1273 0.1163 0.1276 0.1497 0.1583 0.1230 0.1424 0.1480 0.1423 0.1582 0.1551 0.1606
va: 1.2503 1.2273 2.0176 2.0673 2.0754 3.3401 2.9286 3.4928 4.0774 3.9939 3.9781 3.4452 3.9539 3.8964 3.7607 3.9729 3.9122 3.9537 3.4336 4.0442 3.9711 3.8232 3.9589 3.9119 3.9187 3.9178 3.9147 0.9998 0.9967 1.0154 1.0065 0.9857 0.9935 1.0132 0.9897 0.9923 1.0244 1.0068 1.0066 1.0207 0.9919 0.9991 0.9878
dispcorr: -0.029213463 hartree
energy: -2027.478521741454
dipole: -21.56764 18.72280 -2.84484 -11.12015 12.13435 1.01420 15.91375 -13.58010 2.33365
magnitude: 3.81676 au
magnitude: 9.70142 debye
