program: Orca
programVersion: 5.0.2
elementType: Cl Cl O O O N N C C C C C C C C C C C C C C C C C C C C H H H H H H H H H H H H H H H H
charge: 0
multiplicity: 1
keywords: wb97x-d3
keywords: def2-TZVPP
keywords: def2/J RIJCOSX
keywords: DEFGRID2
keywords: scfconv7
keywords: smallprint printgap noloewdin
keywords: NOSOSCF
formula: C20H16Cl2N2O3
InChI: InChI=1/C20H16Cl2N2O3/c1-12-18(19(26)15-9-8-14(21)10-16(15)22)20(24(2)23-12)27-11-17(25)13-6-4-3-5-7-13/h3-10H,11H2,1-2H3
43 atoms
Cl 2.045807 -2.451965 -1.261923
Cl 3.744226 2.449572 -2.523462
O  -0.945188 -0.975617 -0.96957
O  1.685267 -1.248169 2.608954
O  -3.174334 -0.067066 0.255226
N  -1.706546 -2.85304 0.103692
N  -1.480992 -3.640289 1.170961
C  -0.009612 -1.935403 1.154286
C  -0.864371 -1.823646 0.05551
C  -0.484075 -3.098914 1.825143
C  1.188484 -1.201265 1.496916
C  1.85129 -0.348226 0.457827
C  0.027686 -3.723294 3.072055
C  -2.73694 -3.185435 -0.850723
C  -1.06181 0.411665 -0.715044
C  -2.363224 0.78222 -0.036138
C  2.227883 -0.794497 -0.805548
C  2.135783 0.973636 0.79628
C  -2.593431 2.218131 0.259509
C  2.81625 0.058202 -1.726585
C  2.709943 1.847753 -0.107918
C  3.03549 1.378121 -1.370486
C  -3.820623 2.597642 0.806968
C  -1.627852 3.194986 0.010091
C  -4.07661 3.92574 1.097859
C  -1.886248 4.524365 0.305246
C  -3.109455 4.891693 0.847695
H  -0.508761 -4.650328 3.268983
H  1.090792 -3.955343 3.00218
H  -0.103699 -3.066987 3.932864
H  -2.309652 -3.384016 -1.83236
H  -3.233704 -4.083848 -0.49852
H  -3.468059 -2.385417 -0.933564
H  -0.228458 0.785592 -0.11834
H  -1.000136 0.900865 -1.689058
H  1.868332 1.335554 1.780905
H  3.108932 -0.307758 -2.701315
H  2.900119 2.875388 0.169852
H  -4.578326 1.850766 1.004229
H  -0.663911 2.939297 -0.410536
H  -5.031109 4.209796 1.521241
H  -1.130004 5.273468 0.111502
H  -3.309598 5.93054 1.076793
elementType: Cl O N C H
totalener: -2027.45177527 hartree
nucrepener: 2780.03106466 hartree
electener: -4807.48283993 hartree
oneelecener: -8306.70306550 hartree
twoeener: 3499.22022557 hartree
cpcmener: -0.03559735 hartree
kineticenergy: 2021.49350797 hartree
xcener: -148.637235604028 hartree
chargesum: -0.0000000
charge: -0.060481 -0.072537 -0.343408 -0.438372 -0.420223 0.154013 -0.337616 -0.199485 0.207370 0.085608 0.405039 0.010710 -0.259191 -0.166801 0.074737 0.370755 0.001492 -0.103644 -0.021018 -0.123927 -0.209551 0.123190 -0.140643 -0.168720 -0.163444 -0.170806 -0.114284 0.095891 0.102031 0.101368 0.122047 0.112391 0.115985 0.087177 0.154786 0.150143 0.124500 0.147854 0.143914 0.144007 0.159976 0.157840 0.161331
qa: -0.0605 -0.0725 -0.3434 -0.4384 -0.4202 0.1540 -0.3376 -0.1995 0.2074 0.0856 0.4050 0.0107 -0.2592 -0.1668 0.0747 0.3708 0.0015 -0.1036 -0.0210 -0.1239 -0.2096 0.1232 -0.1406 -0.1687 -0.1634 -0.1708 -0.1143 0.0959 0.1020 0.1014 0.1220 0.1124 0.1160 0.0872 0.1548 0.1501 0.1245 0.1479 0.1439 0.1440 0.1600 0.1578 0.1613
va: 1.2553 1.2319 2.0709 2.0541 2.0619 3.3065 2.9345 3.4398 4.1054 3.9991 3.8903 3.4801 3.9539 3.8870 3.8412 3.8522 3.9641 3.9102 3.6265 4.0466 4.0046 3.8656 3.9580 3.9506 3.9263 3.9450 3.8995 1.0161 0.9977 0.9993 0.9878 1.0110 1.0029 1.0292 0.9933 1.0110 1.0211 1.0047 1.0245 0.9998 0.9924 0.9931 0.9880
dispcorr: -0.025498507 hartree
energy: -2027.477273777829
dipole: -23.43168 22.83645 -0.59523 3.78217 -0.87139 2.91077 12.30540 -13.91482 -1.60942
magnitude: 3.37893 au
magnitude: 8.58855 debye
