program: Orca
programVersion: 5.0.2
elementType: Cl Cl O O O N N C C C C C C C C C C C C C C C C C C C C H H H H H H H H H H H H H H H H
charge: 0
multiplicity: 1
keywords: wb97x-d3
keywords: def2-TZVPP
keywords: def2/J RIJCOSX
keywords: DEFGRID2
keywords: scfconv7
keywords: smallprint printgap noloewdin
keywords: NOSOSCF
formula: C20H16Cl2N2O3
InChI: InChI=1/C20H16Cl2N2O3/c1-12-18(19(26)15-9-8-14(21)10-16(15)22)20(24(2)23-12)27-11-17(25)13-6-4-3-5-7-13/h3-10H,11H2,1-2H3
43 atoms
Cl 1.640271 0.500708 1.475195
Cl 6.679588 0.132457 -0.292331
O  -2.306765 -1.023594 -0.952276
O  0.314325 -0.027582 -2.176956
O  -4.410317 -0.051446 0.278491
N  -1.603587 -2.812157 0.297881
N  -0.489541 -3.432626 0.729884
C  0.071266 -1.613567 -0.470419
C  -1.319346 -1.732057 -0.425063
C  0.525204 -2.723961 0.297947
C  0.813533 -0.659769 -1.261117
C  2.270683 -0.470274 -0.976052
C  1.912416 -3.165483 0.604764
C  -2.911451 -3.322328 0.63637
C  -2.321537 0.380827 -0.771005
C  -3.625917 0.783394 -0.109464
C  2.744867 0.046478 0.223058
C  3.191298 -0.76401 -1.976269
C  -3.894003 2.236186 0.038797
C  4.098147 0.242831 0.445123
C  4.549536 -0.592938 -1.777055
C  4.98845 -0.092433 -0.561431
C  -5.130229 2.64074 0.546648
C  -2.952348 3.20525 -0.310537
C  -5.419535 3.985496 0.696256
C  -3.242876 4.551817 -0.154522
C  -4.476202 4.94372 0.345732
H  1.888713 -4.156666 1.056013
H  2.533915 -3.216981 -0.288923
H  2.406662 -2.495811 1.309264
H  -3.418797 -2.665401 1.340438
H  -3.525633 -3.436912 -0.25395
H  -2.776398 -4.296268 1.095898
H  -1.491115 0.720923 -0.144567
H  -2.228885 0.869088 -1.743127
H  2.841139 -1.152301 -2.924106
H  4.447802 0.65338 1.3824
H  5.251172 -0.8419 -2.561004
H  -5.87102 1.901495 0.8212
H  -1.982473 2.929336 -0.703937
H  -6.382139 4.288811 1.086597
H  -2.50483 5.295193 -0.425127
H  -4.703015 5.995535 0.464073
elementType: Cl O N C H
totalener: -2027.45356646 hartree
nucrepener: 2661.46865294 hartree
electener: -4688.92221940 hartree
oneelecener: -8070.06244425 hartree
twoeener: 3381.14022486 hartree
cpcmener: -0.03341772 hartree
kineticenergy: 2021.48463567 hartree
xcener: -148.633275312294 hartree
chargesum: -0.0000000
charge: -0.065964 -0.076114 -0.325873 -0.438179 -0.417655 0.118767 -0.333208 -0.232361 0.284769 0.094666 0.381981 0.072051 -0.270329 -0.177189 0.046634 0.358416 -0.050666 -0.143750 -0.024231 -0.119094 -0.165649 0.103002 -0.136586 -0.169081 -0.163440 -0.165413 -0.119388 0.106723 0.113007 0.106430 0.121585 0.124340 0.114969 0.122705 0.135497 0.148099 0.127268 0.147167 0.142681 0.142813 0.159243 0.159894 0.161464
qa: -0.0660 -0.0761 -0.3259 -0.4382 -0.4177 0.1188 -0.3332 -0.2324 0.2848 0.0947 0.3820 0.0721 -0.2703 -0.1772 0.0466 0.3584 -0.0507 -0.1437 -0.0242 -0.1191 -0.1656 0.1030 -0.1366 -0.1691 -0.1634 -0.1654 -0.1194 0.1067 0.1130 0.1064 0.1216 0.1243 0.1150 0.1227 0.1355 0.1481 0.1273 0.1472 0.1427 0.1428 0.1592 0.1599 0.1615
va: 1.2482 1.2272 2.1079 2.0452 2.0624 3.3136 2.9280 3.3830 4.1456 3.9704 3.9023 3.4234 3.9787 3.8932 3.8407 3.9130 3.9607 3.9720 3.6116 4.0412 4.0043 3.8787 3.9615 3.9531 3.9293 3.9306 3.9001 1.0194 0.9890 0.9933 0.9925 0.9894 1.0118 0.9891 0.9992 1.0069 1.0187 1.0037 1.0254 1.0064 0.9924 0.9919 0.9880
dispcorr: -0.023432802 hartree
energy: -2027.476999259443
dipole: -26.62478 26.86140 0.23662 -0.91322 2.10395 1.19073 -0.56837 0.71593 0.14756
magnitude: 1.22295 au
magnitude: 3.10848 debye
